{"text_format":"1","workbook":"xlsx","n_sheets":16,"sheets":["Índice","Presentación","Informantes","Participantes","CNGE_2026_M6_Secc2_Sub1","CNGE_2026_M6_Secc2_Sub2","CNGE_2026_M6_Secc2_Sub3","CNGE_2026_M6_Secc2_Sub4","CNGE_2026_M6_Secc2_Sub5","CNGE_2026_M6_Secc2_Sub6","CNGE_2026_M6_Secc2_Sub7","CNGE_2026_M6_Secc2_Sub8","Complemento1","Glosario","listas","comparativo"],"not_rendered":{"charts":0,"images":4,"macros":1,"external_links":0,"defined_names":91,"comments":0,"pivot_tables":0},"unopened":[],"bounds":{"document_bytes":16777216,"sheet_cells":100000,"rows_first":2000,"rows_last":500,"rows_between":2000,"halvings":0,"cell_chars":16384,"cell_head_chars":4096},"cells_cut":0,"cells_raw":0,"read":"whole","date_system":"1900"}

{"sheet":"Índice","index":0,"n_rows":37,"n_cols":33,"rows_kept":37,"cut":false,"hidden":false,"merged":[[32,2,32,20],[32,23,32,29],[34,1,34,20],[36,1,36,20],[26,2,26,20],[26,23,26,29],[28,2,28,20],[28,23,28,29],[30,2,30,20],[30,23,30,29],[20,2,20,20],[20,23,20,29],[22,2,22,20],[22,23,22,29],[24,2,24,20],[24,23,24,29],[18,23,18,29],[0,1,0,29],[2,1,2,29],[4,1,4,29],[6,1,6,29],[8,1,8,11],[8,13,8,14],[10,1,10,20],[12,1,12,20],[14,1,14,20],[16,1,16,20],[18,2,18,20]]}
[null,"CENSO NACIONAL DE GOBIERNOS\nESTATALES 2026"]
[]
[null,"Módulo 6.\nCatastro, registro y territorio"]
[]
[null,"Sección II. Registro Público de la Propiedad"]
[]
[null,"Índice"]
[null,"Entidad:",null,null,null,null,null,null,null,null,null,null,null,"Clave:"]
[null,null,null,null,null,null,null,null,null,null,null,null,null,{"$f":"IF(B9=\"\",\"\",VLOOKUP(B9,L_ENTIDAD2,2,FALSE))","v":""},null,null,null,null,null,null,null,null,null,null,null,null,null,null,null,null,null,null,{"$f":"IF(B9<>\"\",0,1)","v":1}]
[]
[null,"Presentación"]
[]
[null,"Informantes"]
[]
[null,"Participantes"]
[]
[null,"Sección II. Registro Público de la Propiedad"]
[]
[null,null,"Subsección II.1 Estructura de la institución registral",null,null,null,null,null,null,null,null,null,null,null,null,null,null,null,null,null,null,null,null,"Preguntas 2.1 a 2.7"]
[]
[null,null,"Subsección II.2 Recursos humanos y capacitación",null,null,null,null,null,null,null,null,null,null,null,null,null,null,null,null,null,null,null,null,"Preguntas 2.8 a 2.18"]
[]
[null,null,"Subsección II.3 Marco jurídico",null,null,null,null,null,null,null,null,null,null,null,null,null,null,null,null,null,null,null,null,"Preguntas 2.19 a 2.25"]
[]
[null,null,"Subsección II.4 Trámites y servicios registrales",null,null,null,null,null,null,null,null,null,null,null,null,null,null,null,null,null,null,null,null,"Preguntas 2.26 a 2.51"]
[]
[null,null,"Subsección II.5 Conservación y consulta del acervo documental",null,null,null,null,null,null,null,null,null,null,null,null,null,null,null,null,null,null,null,null,"Preguntas 2.52 a 2.58"]
[]
[null,null,"Subsección II.6 Tecnologías de la información",null,null,null,null,null,null,null,null,null,null,null,null,null,null,null,null,null,null,null,null,"Preguntas 2.59 a 2.70",null,null,null,null,null,null,null,null,0]
[]
[null,null,"Subsección II.7 Vinculación e intercambio de información registral",null,null,null,null,null,null,null,null,null,null,null,null,null,null,null,null,null,null,null,null,"Preguntas 2.71 a 2.73"]
[]
[null,null,"Subsección II.8 Programa de modernización de los registros públicos de la propiedad y catastros",null,null,null,null,null,null,null,null,null,null,null,null,null,null,null,null,null,null,null,null,"Preguntas 2.74 a 2.75"]
[]
[null,"Complemento 1"]
[]
[null,"Glosario"]

{"sheet":"Presentación","index":1,"n_rows":130,"n_cols":108,"rows_kept":130,"cut":false,"hidden":true,"merged":[[127,6,127,28],[128,8,128,28],[129,6,129,16],[129,20,129,28],[115,3,115,28],[117,7,117,28],[119,7,119,28],[123,2,123,28],[125,6,125,28],[126,10,126,28],[111,3,111,28],[101,5,101,9],[101,10,101,25],[102,5,102,9],[102,10,102,25],[103,5,103,9],[103,10,103,25],[104,5,104,9],[104,10,104,25],[105,5,105,9],[105,10,105,25],[107,2,107,28],[99,2,99,28],[75,2,75,28],[77,2,77,28],[79,2,79,28],[81,3,81,28],[83,2,83,28],[85,2,85,28],[87,2,87,28],[91,2,91,28],[93,2,93,28],[95,2,95,28],[97,2,97,28],[73,3,73,28],[51,2,51,28],[53,2,53,28],[55,2,55,28],[57,2,57,28],[59,2,59,28],[61,3,61,28],[63,2,63,28],[65,3,65,28],[67,3,67,28],[69,3,69,28],[71,3,71,28],[49,2,49,28],[27,2,27,28],[29,2,29,28],[31,2,31,28],[33,3,33,28],[35,2,35,28],[37,2,37,28],[39,2,39,28],[41,2,41,28],[43,2,43,28],[45,2,45,28],[47,3,47,28],[24,2,24,28],[0,1,0,29],[2,1,2,29],[4,1,4,29],[6,1,6,29],[8,26,8,29],[9,1,9,11],[9,13,9,14],[12,2,12,28],[15,2,15,28],[17,2,17,28],[19,2,19,28],[21,2,21,28]]}
[null,"CENSO NACIONAL DE GOBIERNOS\nESTATALES 2026",null,null,null,null,null,null,null,null,null,null,null,null,null,null,null,null,null,null,null,null,null,null,null,null,null,null,null,null,null,null,{"$f":"IF(B10<>\"\",IF(OR(H118=\"\",H120=\"\",G126=\"\",K127=\"\",G128=\"\",I129=\"\",G130=\"\"),1,0),0)","v":0}]
[]
[null,"Módulo 6. \nCatastro, registro y territorio"]
[]
[null,"Sección II. Registro Público de la Propiedad"]
[]
[null,"Presentación"]
[]
[null,"Entidad:",null,null,null,null,null,null,null,null,null,null,null,"Clave:",null,null,null,null,null,null,null,null,null,null,null,null,"Índice"]
[null,{"$f":"IF(Índice!B9=\"\",\"\",Índice!B9)","v":""},null,null,null,null,null,null,null,null,null,null,null,{"$f":"IF(Índice!N9=\"\",\"\",Índice!N9)","v":""}]
[]
[null,null,"OBLIGATORIEDAD"]
[null,null,"Conforme a lo dispuesto por el artículo 45, párrafo primero de la Ley del Sistema Nacional de Información Estadística y Geográfica (LSNIEG): \"Los Informantes del Sistema estarán obligados a proporcionar, con veracidad y oportunidad, los datos e informes que les soliciten las autoridades competentes para fines estadísticos, censales y geográficos, y prestarán apoyo a las mismas\", así como lo señalado por el artículo 46 de la misma: \"[...] Los servidores públicos de la Federación, de las entidades federativas, de los municipios y de las demarcaciones territoriales de la Ciudad de México, tendrán la obligación de proporcionar la información básica que hubieren obtenido en el ejercicio de sus funciones y sirva para generar Información de Interés Nacional, que les solicite el Instituto [...]\""]
[]
[null,null,"CONFIDENCIALIDAD Y RESERVA"]
[null,null,"En términos de los artículos 37 y 38 de la LSNIEG, los datos e informes que proporcionen para fines estadísticos los informantes del Sistema, como son las Unidades del Estado, y que provengan de registros administrativos, serán manejados observando los principios de confidencialidad y reserva. Por esto, no podrán divulgarse en ningún caso en forma nominativa o individualizada, ni harán prueba ante autoridad judicial o administrativa, incluyendo la fiscal, en juicio o fuera de él. Cuando se deba divulgar la información, esta deberá estar agregada de tal manera que no se pueda identificar a los informantes del SNIEG y, en general, a las personas físicas o morales objeto de la información."]
[]
[null,null,"En este sentido, atendiendo las atribuciones de la LSNIEG, el Instituto realiza sus acciones con apego a estándares internacionales, es decir, la protección que la LSNIEG otorga a la información estadística y geográfica cumple con los procedimientos para atender los Principios Fundamentales de las Estadísticas Oficiales, adoptados mediante Resolución 68/261 de la Asamblea General de las Naciones Unidas, aprobada el 29 de enero de 2014. Estos prevén, en el principio 6, relativo a la confidencialidad, que los datos individuales que reúnan los organismos de estadística para la compilación de la información relacionada con personas físicas o morales, deben ser estrictamente confidenciales y utilizarse exclusivamente para fines estadísticos. Atendiendo, además, lo establecido por el Manual del Marco de Aseguramiento de la Calidad para las Estadísticas Oficiales Nacionales, adoptado por la Comisión de Estadística de las Naciones Unidas en su 50ª sesión, celebrada en marzo de 2019, el cual brinda apoyo a los países para salvaguardar el papel de las estadísticas oficiales como fuente confiable de información."]
[]
[null,null,"Asimismo, el Instituto expide normatividad que asegura la correcta difusión y el acceso del público a la información, como es el caso de la Política para la Gestión de la Confidencialidad en la Información Estadística y Geográfica, utilizando en sus procesos a la anonimización como herramienta para mitigar los riesgos que presentan la obtención y tratamiento masivo de datos que contengan identificadores y datos confidenciales. Lo anterior, garantiza seguridad jurídica a la información proporcionada por las Unidades del Estado al Instituto, ya que esta solo se dará a conocer de manera agregada, protegiendo en todo momento los principios señalados en la LSNIEG. En ningún momento se publican datos individualizados para identificar a una persona determinada, que pudieran poner en riesgo a las mismas o a las instituciones."]
[]
[null,null,"En contexto, la información estadística generada por el INEGI a partir de la información proporcionada por las Unidades del Estado no queda sujeta a mecanismos de reserva, puesto que su actuar no es como sujeto obligado dentro del régimen normativo en materia de transparencia y acceso a la información pública; por lo que resultan inaplicables las reservas de información establecidas en la Ley General de Transparencia y Acceso a la Información Pública, en las leyes locales de transparencia y en la Ley General del Sistema Nacional de Seguridad Pública, así como en las normativas locales de los sistemas de seguridad pública, sino a lo dispuesto por la LSNIEG, misma que no contempla la clasificación de Información como reservada, ya que cuenta con mecanismos propios para la protección de la información. Precisando que, en términos del artículo 28 QUINTUS y de la fracción IV del artículo 77 de la LSNIEG corresponde a la Junta de Gobierno del INEGI, como órgano superior de dirección del Instituto, determinar la información que deba ser de divulgación restringida por motivos de seguridad nacional."]
[]
[null,null,"DERECHOS DE LOS INFORMANTES DEL SISTEMA"]
[null,null,"De conformidad con lo previsto en el artículo 41 de la LSNIEG, los informantes del Sistema tendrán el derecho de solicitar al Instituto Nacional de Estadística y Geografía que sean rectificados los datos que les conciernan, para lo cual deberán demostrar que son inexactos, incompletos o equívocos."]
[]
[]
[null,null,"El Instituto Nacional de Estadística y Geografía (INEGI) presenta la elaboración del Censo Nacional de Gobiernos Estatales (CNGE) 2026 como respuesta a su responsabilidad de suministrar a la sociedad y al Estado información de calidad, pertinente, veraz y oportuna, atendiendo el mandato constitucional de normar y coordinar el Sistema Nacional de Información Estadística y Geográfica (SNIEG)."]
[]
[null,null,"Dicho Sistema se integra por cuatro subsistemas, mismos que permiten agrupar por temas los diversos campos de información de interés nacional, lo que se traduce en la generación, suministro y difusión de información de manera ordenada y bajo esquemas integrales y homogéneos que promuevan el cumplimiento de los objetivos del SNIEG."]
[]
[null,null,"Los subsistemas son los siguientes:"]
[]
[null,null,null,"Subsistema Nacional de Información Demográfica y Social.\nSubsistema Nacional de Información Económica.\nSubsistema Nacional de Información Geográfica, Medio Ambiente, Ordenamiento Territorial y Urbano.\nSubsistema Nacional de Información de Gobierno, Seguridad Pública e Impartición de Justicia."]
[]
[null,null,"El Subsistema Nacional de Información de Gobierno, Seguridad Pública e Impartición de Justicia (SNIGSPIJ) fue creado mediante acuerdo de la Junta de Gobierno del INEGI el 08 de diciembre de 2008, quedando establecido como el cuarto Subsistema Nacional de Información según los artículos 17 y 28 bis de la Ley del SNIEG."]
[]
[null,null,"El SNIGSPIJ tiene como objetivo estratégico institucionalizar y operar un esquema coordinado para la producción, integración, conservación y difusión de información estadística y geográfica de interés nacional, de calidad, pertinente, veraz y oportuna que permita conocer la situación que guardan la gestión y el desempeño de las instituciones públicas que conforman el Estado y sus respectivos poderes en las funciones de gobierno, seguridad pública e impartición de justicia, para apoyar los procesos de diseño, implementación, monitoreo y evaluación de las políticas públicas en estas materias."]
[]
[null,null,"En el marco de dicho Subsistema, específicamente de los trabajos del Comité Técnico Especializado de Información de Gobierno, desde el año 2009 se iniciaron las actividades de revisión y generación de lo que sería el primer instrumento de captación en materia de gobierno, en el que participaron personas representantes de las principales instituciones y organizaciones que convergen en dicha materia."]
[]
[null,null,"Como resultado, se logró el acuerdo para generar información estadística en la referida materia con una visión integral, implementando en 2010 el primer instrumento de captación en el ámbito estatal denominado Encuesta Nacional de Gobierno 2010 – Poder Ejecutivo Estatal (ENGPEE 10), con lo cual se inició una serie de información que permite diseñar, monitorear y evaluar las políticas públicas en dicho tema."]
[]
[null,null,"Posteriormente, en 2011 se realizó el segundo levantamiento de este instrumento estadístico bajo la denominación de Censo Nacional de Gobierno 2011. Poder Ejecutivo Estatal (CNG 2011 PEE). El 20 de diciembre de ese mismo año se publicó en el Diario Oficial de la Federación el acuerdo por el cual la Junta de Gobierno del INEGI determinó como Información de Interés Nacional (IIN) los datos generados por este censo, otorgándoles el carácter de oficiales y de uso obligatorio para la Federación, las entidades federativas, el Distrito Federal (ahora Ciudad de México) y los municipios, siendo a partir de ese momento que se institucionalizó como Censo Nacional de Gobierno, Seguridad Pública y Sistema Penitenciario Estatales (CNGSPSPE), por lo que dicha edición (con información 2010) se publicó con la categoría de IIN."]
[]
[null,null,"Desde entonces se continuaron anualmente las labores de levantamiento del CNGSPSPE hasta su última edición en 2020. Para la edición 2021, sus contenidos se dividieron en tres Censos Nacionales de Gobierno; cada uno orientado a las materias específicas de gobierno, seguridad pública y sistema penitenciario:"]
[]
[null,null,null,"Censo Nacional de Gobiernos Estatales;\nCenso Nacional de Seguridad Pública Estatal; y\nCenso Nacional de Sistemas Penitenciarios Estatales."]
[]
[null,null,"Lo anterior, como resultado de las reformas constitucionales realizadas en los últimos años, entre las que destacan aquellas en materia de seguridad pública y combate a la corrupción. En consecuencia, el Estado mexicano ha transitado por un periodo de evolución, crecimiento y diversificación institucional, multiplicando con ello sus obligaciones, responsabilidades y facultades. Desde el punto de vista estadístico, los nuevos arreglos institucionales y compromisos establecidos por ley generaron nuevas necesidades de información, lo que conllevó a realizar ajustes en materias y conceptos previamente establecidos.",null,null,null,null,null,null,null,null,null,null,null,null,null,null,null,null,null,null,null,null,null,null,null,null,null,null,null,null,null,null,null,null,null,40,{"$f":"IFERROR(IF(HLOOKUP($N$8,$BY$7:$DD$587,AK51,FALSE)=0,\"\",HLOOKUP($N$8,$BY$7:$DD$587,AK51,FALSE)),\"\")","v":""},{"$f":"IFERROR(IF(HLOOKUP($N$8,$AP$7:$BU$587,AK51,FALSE)=0,\"\",HLOOKUP($N$8,$AP$7:$BU$587,AK51,FALSE)),\"\")","v":""},null,42,null,null,null,null,null,null,"07041","08041",null,null,"11041","12041","13041","14041","15041","16041",null,null,"19041","20041","21041",null,null,"24041",null,"26041",null,"28041","29041","30041","31041","32041",null,null,null,null,null,null,null,null,null,"La Independencia","Maguarichi",null,null,"Uriangato","Malinaltepec","Mixquiahuala de Juárez","Huejúcar","Ixtapan del Oro","Irimbo",null,null,"Pesquería","Huautla de Jiménez","Cuautlancingo",null,null,"Tanlajás",null,"Nacozari de García",null,"Victoria","Papalotla de Xicohténcatl","Coetzala","Kanasín","El Salvador"]
[null,null,null,null,null,null,null,null,null,null,null,null,null,null,null,null,null,null,null,null,null,null,null,null,null,null,null,null,null,null,null,null,null,null,null,null,41,{"$f":"IFERROR(IF(HLOOKUP($N$8,$BY$7:$DD$587,AK54,FALSE)=0,\"\",HLOOKUP($N$8,$BY$7:$DD$587,AK54,FALSE)),\"\")","v":""},{"$f":"IFERROR(IF(HLOOKUP($N$8,$AP$7:$BU$587,AK54,FALSE)=0,\"\",HLOOKUP($N$8,$AP$7:$BU$587,AK54,FALSE)),\"\")","v":""},null,43,null,null,null,null,null,null,"07042","08042",null,null,"11042","12042","13042","14042","15042","16042",null,null,"19042","20042","21042",null,null,"24042",null,"26042",null,"28042","29042","30042","31042","32042",null,null,null,null,null,null,null,null,null,"Ixhuatán","Manuel Benavides",null,null,"Valle de Santiago","Mártir de Cuilapan","Molango de Escamilla","Huejuquilla el Alto","Ixtlahuaca","Ixtlán",null,null,"Los Ramones","Ixtlán de Juárez","Cuayuca de Andrade",null,null,"Tanquián de Escobedo",null,"Navojoa",null,"Villagrán","Xicohtzinco","Colipa","Kantunil","Sombrerete"]
[null,null,"En materia de gobierno, los ajustes realizados respondieron fundamentalmente a la atención de las necesidades de información derivadas de la creación del Sistema Nacional Anticorrupción y del Sistema Nacional de Archivos, principalmente en lo que atañe a las funciones de control interno y anticorrupción, compras públicas, y sobre la administración y gestión documental realizadas en cada una de las instituciones del ámbito local."]
[]
[null,null,"Este proceso de segmentación implicó revocar la determinación de Información de Interés Nacional al CNGSPSPE, mediante el acuerdo de la Junta de Gobierno del INEGI publicado el 29 de enero de 2021 en el Diario Oficial de la Federación. Su finalidad fue ampliar el alcance temático y analítico de cada rubro, así como adecuar conceptual y metodológicamente sus contenidos a las necesidades de información vigentes en las reformas constitucionales y en la transformación institucional del país."]
[]
[null,null,"Derivado de dicha división, a la fecha se encuentra publicado el Censo Nacional de Gobiernos Estatales (CNGE) 2025, cuyos resultados pueden ser consultados en la página de internet del Instituto: https://www.inegi.org.mx/programas/cnge/2025/"]
[]
[null,null,"De esta forma, se presenta el Censo Nacional de Gobiernos Estatales (CNGE) 2026 como el decimoséptimo censo desarrollado por el INEGI en materia de gobierno en el ámbito estatal del Estado mexicano. Si bien el proceso de maduración de la información captada a través de este ha obligado a realizar ajustes en algunas variables, se ha preservado en todo momento la consistencia conceptual respecto de sus ediciones anteriores, continuando con la serie estadística y enriqueciendo sus contenidos por los temas que actualmente se desarrollan."]
[]
[null,null,"El CNGE 2026 se conforma por los siguientes módulos:"]
[]
[null,null,null,"Módulo 1. Administración Pública de la entidad federativa.\nMódulo 2. Protección civil.\nMódulo 3. Servicios periciales y/ o servicio médico forense.\nMódulo 4. Defensoría pública.\nMódulo 5. Medio ambiente.\nMódulo 6. Catastro, registro y territorio."]
[]
[null,null,"Cada uno de estos módulos está conformado, cuando menos, por los siguientes apartados:"]
[]
[null,null,null,"Presentación. Contiene la introducción general y antecedentes del censo, así como las instrucciones generales para la entrega formal del presente instrumento de captación."]
[]
[null,null,null,"Informantes. En este apartado se recaba información sobre las personas servidoras públicas designadas por las Unidades del Estado como responsables de recopilar, integrar y entregar la información requerida en el cuestionario."]
[]
[null,null,null,"Participantes. Presenta un espacio destinado a la identificación de las personas servidoras públicas que participaron en el llenado de cada módulo y/ o sección, según corresponda."]
[]
[null,null,null,"Cuestionario. Se integra por cada una de las preguntas destinadas a generar información estadística sobre los aspectos que conforman la estructura temática del presente censo. Con la finalidad de facilitar la ubicación de los temas contenidos, la versión electrónica del mismo se ha dividido en tantas pestañas como secciones son requeridas."]
[]
[null,null,null,"Glosario. Contiene un listado de conceptos y definiciones que se consideran relevantes para el llenado del cuestionario."]
[]
[null,null,"Asimismo, tomando en consideración la naturaleza de la información solicitada en cada módulo, algunos de estos pueden presentar apartados adicionales a los anteriores, mismos que obedecen a las características específicas del censo relacionado. Dichos apartados pueden ser: complementos, anexos y adiciones."]
[]
[null,null,"Particularmente, en el módulo 6 se solicita, entre otra, información sobre la estructura organizacional de las instituciones encargadas del ejercicio de catastro, registro público de la propiedad y planeación y gestión territorial de cada entidad federativa; la distribución de los recursos humanos; la cantidad, tipos y características de acceso a los trámites y servicios prestados; así como los elementos y acciones institucionales que se llevan a cabo para la vinculación e intercambio de la información, entre otros."]
[]
[null,null,"Para ello, este módulo contiene 238 preguntas agrupadas en las siguientes secciones:"]
[]
[null,null,null,"Sección I. Catastro.\nSección II. Registro público de la propiedad.\nSección III. Planeación y gestión territorial."]
[]
[null,null,"Considerando la relevancia y diversidad de la información solicitada a través del cuestionario, es necesario que las personas informantes sean funcionarios y funcionarias públicas que, por sus atribuciones y actividades cotidianas, cuenten con la información adecuada y necesaria. A efecto de facilitar la recolección de la información solicitada, pueden auxiliarse de las personas servidoras públicas que integran sus equipos de trabajo. Cuando esto suceda, se solicita que registren sus datos en el apartado Participantes."]
[]
[null,null,"Las personas servidoras públicas que se establecen como informantes deberán formalizar la entrega de la información proporcionada, ello mediante el estampado de su firma en la sección \"Informantes\" de cada módulo o sección, así como del sello de la institución que representan. Cabe destacar que la información recabada mediante el censo, una vez recibida con la firma de la o las personas informantes y sello de la institución, será considerada como información oficial en términos de lo establecido en la Ley del SNIEG."]
[]
[null,null,"El INEGI pondrá a disposición de la sociedad la información de este programa de forma gratuita a través del Servicio Público de Información, además de poder consultarse y descargarse de forma electrónica en el portal del Instituto: https://inegi.org.mx/programas/ "]
[]
[]
[]
[null,null,"La entrega de información deberá hacerse a través de la Coordinación Estatal del INEGI en su entidad federativa, cuyo personal se acercará a los equipos de trabajo designados como responsables del llenado del cuestionario, con el objetivo de organizar los trabajos y recuperar la información requerida."]
[]
[null,null,"La información que se entregue al INEGI tendrá un proceso de revisión y validación por parte de su personal en la Coordinación Estatal y oficinas centrales, por lo que tendrá carácter de preliminar y será susceptible de ajuste o aclaración hasta que el INEGI notifique la liberación como información definitiva. Posterior a que el personal de la Coordinación Estatal del INEGI concluya la revisión, el cuestionario podrá ser devuelto a la persona servidora pública responsable del llenado en la institución informante, a efecto de notificarle los resultados de la revisión y los ajustes o aclaraciones de información que, de ser procedentes, deberán atenderse. En caso de no presentar observaciones o hayan sido atendidas satisfactoriamente, será remitido a las oficinas centrales del Instituto para una verificación y revisión adicional."]
[]
[null,null,"Si la verificación y revisión central arroja observaciones o solicitudes de aclaración de información, el cuestionario será devuelto a la Coordinación Estatal para la atención o justificación de estas situaciones con apoyo de la institución informante. En caso de que no existan observaciones, o estas se hayan atendido satisfactoriamente, se procederá con la liberación del cuestionario como versión definitiva para su formalización mediante la firma y sello del instrumento físico por parte de las personas informante básica e informantes complementarias. Cabe señalar que, como parte del proceso de generación de información, la información liberada se somete a la ejecución de otras fases previo a la publicación de resultados, tales como las de procesamiento y análisis de la información, existiendo la posibilidad de que surjan dudas o solicitudes de aclaración, para lo cual se solicita el apoyo de las fuentes informantes."]
[]
[null,null,"Para cumplir con lo anterior, una vez completado el llenado de este instrumento, deberá enviarse en versión preliminar a la dirección electrónica del Departamento de Estadísticas de Gobierno (JDEG) de la Coordinación Estatal del INEGI: xxxxxxxxx@inegi.org.mx"]
[]
[null,null,"De igual forma, en la siguiente tabla se detallan los periodos en los que se realizarán las actividades señaladas:"]
[]
[null,null,null,null,null,"Fecha",null,null,null,null,"Actividad"]
[null,null,null,null,null,"XX de XXX al XX de XXX",null,null,null,null,"Integración de información por la institución informante. \nEntrega a la CE del INEGI para revisión."]
[null,null,null,null,null,"XX de XXX al XX de XXX",null,null,null,null,"Revisión de información preliminar por parte de la CE del INEGI y aclaración o ajustes por parte de la institución informante. \nEnvío de información preliminar a OC para verificación central."]
[null,null,null,null,null,"XX de XXX al XX de XXX",null,null,null,null,"Verificación de información preliminar por parte de OC y aclaración o ajustes de información.\nLiberación de cuestionario como información definitiva."]
[null,null,null,null,null,"XX de XXX al XX de XXX",null,null,null,null,"Recuperación de cuestionario físico con información completa y definitiva, con firma y sello."]
[]
[null,null,"Una vez que el INEGI libere el cuestionario como información definitiva y se tengan las firmas y sellos correspondientes, deberá remitirse vía electrónica y de manera física, garantizando sean las mismas versiones en ambos casos y conforme a lo siguiente:"]
[]
[null,null,null,"1) Entrega electrónica:"]
[]
[null,null,null,"La versión definitiva del cuestionario, en su versión electrónica, deberá remitirse a la dirección electrónica siguiente: xxxxxxxxx@inegi.org.mx"]
[]
[null,null,null,"2) Entrega física:"]
[]
[null,null,null,"La versión impresa, con las firmas y sellos correspondientes, deberá entregarse en la Coordinación Estatal del INEGI con los siguientes datos:"]
[]
[null,null,null,"Destinatario(a):"]
[]
[null,null,null,"Dirección:"]
[]
[]
[]
[null,null,"En caso de dudas o comentarios, hacerlos llegar al personal del Departamento de Estadísticas de Gobierno de la Coordinación Estatal del INEGI que haya sido designado para el seguimiento de este programa de información:"]
[]
[null,null,null,"Nombre:"]
[null,null,null,"Área o unidad de adscripción:"]
[null,null,null,"Cargo:"]
[null,null,null,"Correo electrónico:"]
[null,null,null,"Teléfono:",null,null,null,null,null,null,null,null,null,null,null,null,null,"Extensión:"]

{"sheet":"Informantes","index":2,"n_rows":51,"n_cols":33,"rows_kept":51,"cut":false,"hidden":true,"merged":[[51,2,51,29],[41,5,41,16],[41,20,47,28],[42,6,42,16],[43,7,43,16],[44,7,44,16],[45,4,45,16],[46,5,46,16],[47,7,47,16],[37,1,37,17],[37,19,37,29],[38,2,38,16],[38,19,38,29],[40,12,40,16],[40,20,40,28],[28,5,28,16],[28,20,34,28],[29,6,29,16],[30,7,30,16],[31,7,31,16],[32,4,32,16],[33,5,33,16],[34,7,34,16],[24,1,24,17],[24,19,24,29],[25,2,25,16],[25,19,25,29],[27,12,27,16],[27,20,27,28],[15,5,15,16],[15,20,21,28],[16,6,16,16],[17,7,17,16],[18,7,18,16],[19,4,19,16],[20,5,20,16],[21,7,21,16],[11,1,11,17],[11,19,11,29],[12,2,12,16],[12,19,12,29],[14,12,14,16],[14,20,14,28],[9,1,9,11],[9,13,9,14],[0,1,0,29],[2,1,2,29],[4,1,4,29],[6,1,6,29],[8,26,8,29]]}
[null,"CENSO NACIONAL DE GOBIERNOS\nESTATALES 2026",null,null,null,null,null,null,null,null,null,null,null,null,null,null,null,null,null,null,null,null,null,null,null,null,null,null,null,null,null,null,{"$f":"IF(B10<>\"\",IF(OR(M15=\"\",F16=\"\",G17=\"\",H18=\"\",H19=\"\",E20=\"\",F21=\"\",H22=\"\"),1,0),0)","v":0}]
[]
[null,"Módulo 6.\nCatastro, registro y territorio"]
[]
[null,"Sección II. Registro Público de la Propiedad"]
[]
[null,"Instituciones informantes\n(Responde: Institución registral de la Administración Pública de la entidad federativa)"]
[]
[null,"Entidad:",null,null,null,null,null,null,null,null,null,null,null,"Clave:",null,null,null,null,null,null,null,null,null,null,null,null,"Índice"]
[null,{"$f":"IF(Índice!B9=\"\",\"\",Índice!B9)","v":""},null,null,null,null,null,null,null,null,null,null,null,{"$f":"IF(Índice!N9=\"\",\"\",Índice!N9)","v":""}]
[]
[null,"PERSONA INFORMANTE BÁSICA",null,null,null,null,null,null,null,null,null,null,null,null,null,null,null,null,null,"FIRMA Y SELLO"]
[null,null,"(Persona titular o servidora pública de la(s) institución(es) designada para atender la solicitud de información de la presente sección, y que tiene el carácter de figura responsable de entregar oficialmente la información. Cuando menos, se encuentra en el segundo o tercer nivel jerárquico)",null,null,null,null,null,null,null,null,null,null,null,null,null,null,null,null,"VoBo. a la información contenida en el presente cuestionario"]
[]
[null,null,"Título (Lic., Mtro(a)., Dr(a)., Ing., C., Sr(a)., etc.):",null,null,null,null,null,null,null,null,null,null,null,null,null,null,null,null,null,"FIRMA"]
[null,null,"Nombre(s):"]
[null,null,"Primer apellido:"]
[null,null,"Segundo apellido:"]
[null,null,"Institución u órgano:"]
[null,null,"Cargo:"]
[null,null,"Teléfono:"]
[null,null,"Correo electrónico:"]
[]
[]
[null,"PERSONA INFORMANTE COMPLEMENTARIA 1",null,null,null,null,null,null,null,null,null,null,null,null,null,null,null,null,null,"FIRMA Y SELLO"]
[null,null,"(Persona servidora pública -titular o designada- adscrita al área que es la principal productora de la información correspondiente a la presente sección. Nota: en caso de no requerir este tipo de persona informante deje las siguientes celdas en blanco)",null,null,null,null,null,null,null,null,null,null,null,null,null,null,null,null,"VoBo. a la información contenida en el presente cuestionario"]
[]
[null,null,"Título (Lic., Mtro(a)., Dr(a)., Ing., C., Sr(a)., etc.):",null,null,null,null,null,null,null,null,null,null,null,null,null,null,null,null,null,"FIRMA"]
[null,null,"Nombre(s):"]
[null,null,"Primer apellido:"]
[null,null,"Segundo apellido:"]
[null,null,"Institución u órgano:"]
[null,null,"Cargo:"]
[null,null,"Teléfono:"]
[null,null,"Correo electrónico:"]
[]
[]
[null,"PERSONA INFORMANTE COMPLEMENTARIA 2",null,null,null,null,null,null,null,null,null,null,null,null,null,null,null,null,null,"FIRMA Y SELLO"]
[null,null,"(Persona servidora pública -titular o designada- adscrita al área que es la segunda principal productora de la información correspondiente a la presente sección. Nota: en caso de no requerir esta persona informante deje las siguientes celdas en blanco)",null,null,null,null,null,null,null,null,null,null,null,null,null,null,null,null,"VoBo. a la información contenida en el presente cuestionario"]
[]
[null,null,"Título (Lic., Mtro(a)., Dr(a)., Ing., C., Sr(a)., etc.):",null,null,null,null,null,null,null,null,null,null,null,null,null,null,null,null,null,"FIRMA"]
[null,null,"Nombre(s):"]
[null,null,"Primer apellido:"]
[null,null,"Segundo apellido:"]
[null,null,"Institución u órgano:"]
[null,null,"Cargo:"]
[null,null,"Teléfono:"]
[null,null,"Correo electrónico:"]
[]
[]
[null,null,"OBSERVACIONES:"]

{"sheet":"Participantes","index":3,"n_rows":67,"n_cols":64,"rows_kept":67,"cut":false,"hidden":true,"merged":[[66,28,66,30],[66,31,66,34],[66,35,66,38],[65,39,65,42],[65,43,65,46],[65,47,65,50],[65,51,65,54],[65,55,65,60],[66,2,66,4],[66,5,66,7],[66,8,66,10],[66,11,66,13],[66,14,66,17],[65,18,65,21],[65,22,65,24],[65,25,65,27],[65,28,65,30],[65,31,65,34],[65,35,65,38],[66,39,66,42],[66,43,66,46],[66,47,66,50],[66,51,66,54],[66,55,66,60],[66,18,66,21],[66,22,66,24],[66,25,66,27],[65,2,65,4],[65,5,65,7],[65,8,65,10],[65,11,65,13],[65,14,65,17],[64,18,64,21],[64,22,64,24],[64,25,64,27],[64,28,64,30],[63,39,63,42],[63,43,63,46],[63,47,63,50],[63,51,63,54],[63,55,63,60],[64,2,64,4],[64,5,64,7],[64,8,64,10],[64,11,64,13],[64,14,64,17],[63,18,63,21],[63,22,63,24],[63,25,63,27],[63,28,63,30],[63,31,63,34],[63,35,63,38],[64,39,64,42],[64,43,64,46],[64,47,64,50],[64,51,64,54],[64,55,64,60],[64,31,64,34],[64,35,64,38],[63,2,63,4],[63,5,63,7],[63,8,63,10],[63,11,63,13],[63,14,63,17],[62,18,62,21],[62,22,62,24],[62,25,62,27],[62,28,62,30],[61,43,61,46],[61,47,61,50],[61,51,61,54],[61,55,61,60],[62,2,62,4],[62,5,62,7],[62,8,62,10],[62,11,62,13],[62,14,62,17],[61,18,61,21],[61,22,61,24],[61,25,61,27],[61,28,61,30],[61,31,61,34],[61,35,61,38],[62,39,62,42],[62,43,62,46],[62,47,62,50],[62,51,62,54],[62,55,62,60],[62,31,62,34],[62,35,62,38],[61,2,61,4],[61,5,61,7],[61,8,61,10],[61,11,61,13],[61,14,61,17],[60,18,60,21],[60,22,60,24],[60,25,60,27],[60,28,60,30],[59,39,59,42],[59,8,59,10],[59,11,59,13],[59,14,59,17],[61,39,61,42],[59,43,59,46],[59,47,59,50],[59,51,59,54],[59,55,59,60],[60,2,60,4],[60,5,60,7],[60,8,60,10],[60,11,60,13],[60,14,60,17],[59,18,59,21],[59,22,59,24],[59,25,59,27],[59,28,59,30],[59,31,59,34],[59,35,59,38],[60,39,60,42],[60,43,60,46],[60,47,60,50],[60,51,60,54],[60,55,60,60],[60,31,60,34],[60,35,60,38],[59,2,59,4],[59,5,59,7],[57,39,57,42],[57,43,57,46],[57,47,57,50],[57,51,57,54],[57,55,57,60],[57,31,57,34],[57,35,57,38],[58,39,58,42],[58,43,58,46],[58,47,58,50],[58,51,58,54],[58,55,58,60],[58,31,58,34],[58,35,58,38],[58,2,58,4],[58,5,58,7],[58,8,58,10],[58,11,58,13],[58,14,58,17],[57,18,57,21],[57,22,57,24],[57,25,57,27],[57,28,57,30],[57,2,57,4],[57,5,57,7],[57,8,57,10],[57,11,57,13],[57,14,57,17],[58,18,58,21],[58,22,58,24],[58,25,58,27],[58,28,58,30],[55,39,55,42],[55,43,55,46],[55,47,55,50],[55,51,55,54],[55,55,55,60],[55,31,55,34],[55,35,55,38],[56,39,56,42],[56,43,56,46],[56,47,56,50],[56,51,56,54],[56,55,56,60],[56,31,56,34],[56,35,56,38],[56,2,56,4],[56,5,56,7],[56,8,56,10],[56,11,56,13],[56,14,56,17],[55,18,55,21],[55,22,55,24],[55,25,55,27],[55,28,55,30],[55,2,55,4],[55,5,55,7],[55,8,55,10],[55,11,55,13],[55,14,55,17],[56,18,56,21],[56,22,56,24],[56,25,56,27],[56,28,56,30],[53,39,53,42],[53,43,53,46],[53,47,53,50],[53,51,53,54],[53,55,53,60],[53,31,53,34],[53,35,53,38],[54,39,54,42],[54,43,54,46],[54,47,54,50],[54,51,54,54],[54,55,54,60],[54,31,54,34],[54,35,54,38],[54,2,54,4],[54,5,54,7],[54,8,54,10],[54,11,54,13],[54,14,54,17],[53,18,53,21],[53,22,53,24],[53,25,53,27],[53,28,53,30],[53,2,53,4],[53,5,53,7],[53,8,53,10],[53,11,53,13],[53,14,53,17],[54,18,54,21],[54,22,54,24],[54,25,54,27],[54,28,54,30],[51,39,51,42],[51,43,51,46],[51,47,51,50],[51,51,51,54],[51,55,51,60],[51,31,51,34],[51,35,51,38],[52,39,52,42],[52,43,52,46],[52,47,52,50],[52,51,52,54],[52,55,52,60],[52,31,52,34],[52,35,52,38],[52,2,52,4],[52,5,52,7],[52,8,52,10],[52,11,52,13],[52,14,52,17],[51,18,51,21],[51,22,51,24],[51,25,51,27],[51,28,51,30],[51,2,51,4],[51,5,51,7],[51,8,51,10],[51,11,51,13],[51,14,51,17],[52,18,52,21],[52,22,52,24],[52,25,52,27],[52,28,52,30],[49,39,49,42],[49,43,49,46],[49,47,49,50],[49,51,49,54],[49,55,49,60],[49,31,49,34],[49,35,49,38],[50,39,50,42],[50,43,50,46],[50,47,50,50],[50,51,50,54],[50,55,50,60],[50,31,50,34],[50,35,50,38],[50,2,50,4],[50,5,50,7],[50,8,50,10],[50,11,50,13],[50,14,50,17],[49,18,49,21],[49,22,49,24],[49,25,49,27],[49,28,49,30],[49,2,49,4],[49,5,49,7],[49,8,49,10],[49,11,49,13],[49,14,49,17],[50,18,50,21],[50,22,50,24],[50,25,50,27],[50,28,50,30],[47,39,47,42],[47,43,47,46],[47,47,47,50],[47,51,47,54],[47,55,47,60],[47,31,47,34],[47,35,47,38],[48,39,48,42],[48,43,48,46],[48,47,48,50],[48,51,48,54],[48,55,48,60],[48,31,48,34],[48,35,48,38],[48,2,48,4],[48,5,48,7],[48,8,48,10],[48,11,48,13],[48,14,48,17],[47,18,47,21],[47,22,47,24],[47,25,47,27],[47,28,47,30],[47,2,47,4],[47,5,47,7],[47,8,47,10],[47,11,47,13],[47,14,47,17],[48,18,48,21],[48,22,48,24],[48,25,48,27],[48,28,48,30],[45,39,45,42],[45,43,45,46],[45,47,45,50],[45,51,45,54],[45,55,45,60],[45,31,45,34],[45,35,45,38],[46,39,46,42],[46,43,46,46],[46,47,46,50],[46,51,46,54],[46,55,46,60],[46,31,46,34],[46,35,46,38],[46,2,46,4],[46,5,46,7],[46,8,46,10],[46,11,46,13],[46,14,46,17],[45,18,45,21],[45,22,45,24],[45,25,45,27],[45,28,45,30],[45,2,45,4],[45,5,45,7],[45,8,45,10],[45,11,45,13],[45,14,45,17],[46,18,46,21],[46,22,46,24],[46,25,46,27],[46,28,46,30],[43,39,43,42],[43,43,43,46],[43,47,43,50],[43,51,43,54],[43,55,43,60],[43,31,43,34],[43,35,43,38],[44,39,44,42],[44,43,44,46],[44,47,44,50],[44,51,44,54],[44,55,44,60],[44,31,44,34],[44,35,44,38],[44,2,44,4],[44,5,44,7],[44,8,44,10],[44,11,44,13],[44,14,44,17],[43,18,43,21],[43,22,43,24],[43,25,43,27],[43,28,43,30],[43,2,43,4],[43,5,43,7],[43,8,43,10],[43,11,43,13],[43,14,43,17],[44,18,44,21],[44,22,44,24],[44,25,44,27],[44,28,44,30],[41,39,41,42],[41,43,41,46],[41,47,41,50],[41,51,41,54],[41,55,41,60],[41,31,41,34],[41,35,41,38],[42,39,42,42],[42,43,42,46],[42,47,42,50],[42,51,42,54],[42,55,42,60],[42,31,42,34],[42,35,42,38],[42,2,42,4],[42,5,42,7],[42,8,42,10],[42,11,42,13],[42,14,42,17],[41,18,41,21],[41,22,41,24],[41,25,41,27],[41,28,41,30],[41,2,41,4],[41,5,41,7],[41,8,41,10],[41,11,41,13],[41,14,41,17],[42,18,42,21],[42,22,42,24],[42,25,42,27],[42,28,42,30],[39,39,39,42],[39,43,39,46],[39,47,39,50],[39,51,39,54],[39,55,39,60],[39,31,39,34],[39,35,39,38],[40,39,40,42],[40,43,40,46],[40,47,40,50],[40,51,40,54],[40,55,40,60],[40,31,40,34],[40,35,40,38],[40,2,40,4],[40,5,40,7],[40,8,40,10],[40,11,40,13],[40,14,40,17],[39,18,39,21],[39,22,39,24],[39,25,39,27],[39,28,39,30],[39,2,39,4],[39,5,39,7],[39,8,39,10],[39,11,39,13],[39,14,39,17],[40,18,40,21],[40,22,40,24],[40,25,40,27],[40,28,40,30],[37,39,37,42],[37,43,37,46],[37,47,37,50],[37,51,37,54],[37,55,37,60],[37,31,37,34],[37,35,37,38],[38,39,38,42],[38,43,38,46],[38,47,38,50],[38,51,38,54],[38,55,38,60],[38,31,38,34],[38,35,38,38],[38,2,38,4],[38,5,38,7],[38,8,38,10],[38,11,38,13],[38,14,38,17],[37,18,37,21],[37,22,37,24],[37,25,37,27],[37,28,37,30],[37,2,37,4],[37,5,37,7],[37,8,37,10],[37,11,37,13],[37,14,37,17],[38,18,38,21],[38,22,38,24],[38,25,38,27],[38,28,38,30],[35,39,35,42],[35,43,35,46],[35,47,35,50],[35,51,35,54],[35,55,35,60],[35,31,35,34],[35,35,35,38],[36,39,36,42],[36,43,36,46],[36,47,36,50],[36,51,36,54],[36,55,36,60],[36,31,36,34],[36,35,36,38],[36,2,36,4],[36,5,36,7],[36,8,36,10],[36,11,36,13],[36,14,36,17],[35,18,35,21],[35,22,35,24],[35,25,35,27],[35,28,35,30],[35,2,35,4],[35,5,35,7],[35,8,35,10],[35,11,35,13],[35,14,35,17],[36,18,36,21],[36,22,36,24],[36,25,36,27],[36,28,36,30],[33,39,33,42],[33,43,33,46],[33,47,33,50],[33,51,33,54],[33,55,33,60],[33,31,33,34],[33,35,33,38],[34,39,34,42],[34,43,34,46],[34,47,34,50],[34,51,34,54],[34,55,34,60],[34,31,34,34],[34,35,34,38],[34,2,34,4],[34,5,34,7],[34,8,34,10],[34,11,34,13],[34,14,34,17],[33,18,33,21],[33,22,33,24],[33,25,33,27],[33,28,33,30],[33,2,33,4],[33,5,33,7],[33,8,33,10],[33,11,33,13],[33,14,33,17],[34,18,34,21],[34,22,34,24],[34,25,34,27],[34,28,34,30],[31,39,31,42],[31,43,31,46],[31,47,31,50],[31,51,31,54],[31,55,31,60],[31,31,31,34],[31,35,31,38],[32,39,32,42],[32,43,32,46],[32,47,32,50],[32,51,32,54],[32,55,32,60],[32,31,32,34],[32,35,32,38],[28,28,30,30],[32,2,32,4],[32,5,32,7],[32,8,32,10],[32,11,32,13],[32,14,32,17],[31,18,31,21],[31,22,31,24],[31,25,31,27],[31,28,31,30],[31,2,31,4],[31,5,31,7],[31,8,31,10],[31,11,31,13],[31,14,31,17],[32,18,32,21],[32,22,32,24],[32,25,32,27],[32,28,32,30],[19,2,19,60],[20,3,20,60],[21,2,21,60],[22,3,22,60],[11,1,11,60],[12,1,12,60],[13,2,13,60],[14,2,14,60],[15,2,15,60],[16,2,16,60],[23,3,23,60],[24,3,24,60],[25,4,25,60],[26,3,26,60],[28,1,30,1],[28,2,30,4],[28,5,30,7],[28,8,30,10],[28,11,30,13],[28,14,30,17],[30,35,30,38],[30,39,30,42],[30,43,30,46],[30,47,30,50],[30,51,30,54],[28,31,28,60],[29,31,29,38],[29,39,29,46],[29,47,29,54],[29,55,30,60],[30,31,30,34],[28,18,30,21],[28,22,30,24],[28,25,30,27],[0,1,0,60],[2,1,2,60],[4,1,4,60],[6,1,6,60],[8,57,8,60],[9,1,9,11],[9,13,9,14],[17,2,17,60],[18,2,18,60]]}
[null,"CENSO NACIONAL DE GOBIERNOS\nESTATALES 2026",null,null,null,null,null,null,null,null,null,null,null,null,null,null,null,null,null,null,null,null,null,null,null,null,null,null,null,null,null,null,null,null,null,null,null,null,null,null,null,null,null,null,null,null,null,null,null,null,null,null,null,null,null,null,null,null,null,null,null,null,null,{"$f":"IF(B10<>\"\",IF(OR(C33=\"\",F33=\"\",I33=\"\",L33=\"\",O33=\"\",S33=\"\",W33=\"\",Z33=\"\",AC33=\"\",AF33=\"\",AJ33=\"\"),1,0),0)","v":0}]
[]
[null,"Módulo 6. \nCatastro, registro y territorio"]
[]
[null,"Sección II. Registro Público de la Propiedad"]
[]
[null,"Personas participantes\n(Registrar a las personas servidoras públicas que participaron en la integración de la información y/ o en el llenado de los reactivos que se solicitan en la presente sección. En caso de que las personas registradas como informantes básica y complementarias hayan integrado información, o llenado algunas preguntas, también deben registrarse en el presente apartado)"]
[]
[null,"Entidad:",null,null,null,null,null,null,null,null,null,null,null,"Clave:",null,null,null,null,null,null,null,null,null,null,null,null,null,null,null,null,null,null,null,null,null,null,null,null,null,null,null,null,null,null,null,null,null,null,null,null,null,null,null,null,null,null,null,"Índice"]
[null,{"$f":"IF(Índice!B9=\"\",\"\",Índice!B9)","v":""},null,null,null,null,null,null,null,null,null,null,null,{"$f":"IF(Índice!N9=\"\",\"\",Índice!N9)","v":""}]
[]
[null,"Personas servidoras públicas que participaron en el llenado de la sección"]
[null,"Instrucciones de llenado:"]
[null,null,"Título: anotar el grado escolar o el formalismo para referirse a la persona participante: Licenciado(a), Maestro(a), Doctor(a), Ingeniero(a), Ciudadano(a), Señor(a), etcétera."]
[null,null,"Nombre, primer y segundo apellido: escribir los datos completos, sin abreviaturas y con acentos."]
[null,null,"Institución: registrar el nombre completo de la institución de adscripción."]
[null,null,"Unidad administrativa de adscripción: incluir el nombre completo de la unidad administrativa o área, tal como aparece en su estructura orgánica."]
[null,null,"Cargo o puesto: incluir el nombre completo del cargo o puesto desempeñado."]
[null,null,"Correo electrónico: registrar preferentemente el correo institucional de la persona participante, evitando cuentas genéricas o personales."]
[null,null,"Sección y/ o preguntas en las que participó: registrar la sección, subsección, apartado, subapartado y/ o preguntas en las que participó, conforme a lo siguiente:"]
[null,null,null,"a) Para referirse a preguntas individuales, anotar el número de la pregunta anteponiendo la letra \"P\", separando con coma en caso de ser varias preguntas. Ejemplo: P1.1, P1.3, P1.8.\nb) Si participó en el llenado de todo el cuestionario, anotar la palabra \"Todas\".\nc) Si participó en el llenado de todas las preguntas de una sección, subsección, apartado y/ o subapartado, anotar la nomenclatura correspondiente, separando con comas en caso de que sean dos o más. Ejemplo: I, I.2, I.3.1, I.4.1.1.\nd) En caso de que su participación incluya secciones, subsecciones, apartados o subapartados completos, así como algunas preguntas específicas, anotar de forma combinada. Ejemplo: I, II.2, I.4.2, P1.25, P1.26."]
[null,null,"Principales fuentes de información utilizadas para la integración de la información proporcionada:"]
[null,null,null,"Como fuente principal debe considerar aquella con la cual se genera toda o la mayor parte de información que proporciona, mientras que las fuentes secundarias serían aquellas de las cuales se obtiene el resto de información (cuando hay más de una fuente)."]
[null,null,null,"En la columna Nombre de la fuente debe anotar el nombre o, en caso de no tenerlo, la descripción de la fuente principal y secundarias que utilizó. Si el tipo de fuente es \"De palabra\", en este campo deberá registrar la leyenda \"De palabra\"."]
[null,null,null,"En la columna Tipo de fuente debe clasificar la fuente o fuentes según los tipos establecidos en el catálogo siguiente, con base en las características que más se adapten a esta (seleccionar de la lista desplegable el código o numeral que corresponda al tipo deseado):"]
[null,null,null,null,"Catálogo de tipos de fuente:\n1. Sistema informático propio: corresponde a una solución informática que haya sido desarrollada de manera específica para los fines de la institución, ya sea de forma interna o por un tercero, y tenga el propósito de almacenar o procesar la información generada o utilizada por la institución.\n2. Software comercial especializado: se refiere a algún programa o plataforma comercial diseñada o gestionada por un tercero ajeno a la institución, que sirve para los fines de almacenamiento y procesamiento de su información, sin ser un desarrollo exclusivo para la misma.\n3. Base de datos u hojas de cálculo estructuradas y estandarizadas: se refiere a la existencia de bases de datos, tablas o conjunto de datos planos que se encuentran estructurados y estandarizados, permitiendo su explotación o consulta a través de un software estadístico o de bases de datos o funciones automatizadas o semi automatizadas (considera archivos que incluyan tablas dinámicas, programación de macros en VBA, formularios y BD en Access o similares).\n4. Hojas de cálculo no estructuradas o no estandarizadas: corresponde a que la fuente de información son libros u hojas de Excel o software similar, que concentran información generada por la institución y es consultada de forma directa sin posibilidad de hacer consultas de forma masiva o de un conjunto de datos de forma automatizada o semi automatizada. \n5. Libro de gobierno en formato electrónico: corresponde a los libros o documentos en formato electrónico que se organizan conforme a lineamientos específicos y cuentan con formalidades como foliación, firmas, sellos, autorizaciones, etcétera, que contienen los registros de los procesos o actividades sustantivas del área o institución que genera la información.\n6. Libro de gobierno en papel: corresponde a los libros o documentos físicos que se organizan conforme a lineamientos específicos y cuentan con formalidades como foliación, firmas, sellos, autorizaciones, etcétera, que contienen los registros de los procesos o actividades sustantivas del área o institución que genera la información.\n7. Bitácora en documento de texto electrónico: se refiere al registro o fuente en la que la información contenida está registrada en documentos electrónicos sin la formalidad de un libro de gobierno y que se utiliza para las actividades cotidianas del área o institución que proporciona la información.\n8. Bitácora en documento de texto en papel: se refiere al registro o fuente en la que la información contenida está registrada en documentos físicos sin la formalidad de un libro de gobierno y que se utiliza para las actividades cotidianas del área o institución que proporciona la información.\n9. De palabra: corresponde a cuando no existe una documentación o registro físico o electrónico y la información se obtiene \"de palabra\", es decir, la información se obtiene directamente de las personas involucradas en las actividades (ellas son la fuente) y está supeditada a la memoria de las personas servidoras públicas, no existiendo evidencia documental de lo reportado.\n10. Otra: se debe seleccionar cuando ninguno de los tipos de fuente listados anteriormente responde a las características de la fuente o medio de registro que es utilizado por el área o persona participante para el registro de la información proporcionada en este instrumento de captación."]
[null,null,null,"En caso de que seleccione la categoría \"Otra\" en alguna de las columnas \"Tipo de fuente\", favor de especificar ese otro tipo de fuente en la columna \"Comentarios o especificaciones sobre el tipo de fuente\"."]
[]
[null,"No. ","Título",null,null,"Nombre(s)",null,null,"Primer apellido",null,null,"Segundo apellido",null,null,"Institución",null,null,null,"Unidad administrativa de adscripción ",null,null,null,"Cargo o puesto ",null,null,"Correo electrónico",null,null,"Sección y/ o preguntas en las que participó",null,null,"Principales fuentes utilizadas para la integración de la información proporcionada"]
[null,null,null,null,null,null,null,null,null,null,null,null,null,null,null,null,null,null,null,null,null,null,null,null,null,null,null,null,null,null,null,"Fuente principal",null,null,null,null,null,null,null,"Fuente secundaria 1",null,null,null,null,null,null,null,"Fuente secundaria 2",null,null,null,null,null,null,null,"Comentarios o especificaciones sobre el tipo de fuente"]
[null,null,null,null,null,null,null,null,null,null,null,null,null,null,null,null,null,null,null,null,null,null,null,null,null,null,null,null,null,null,null,"Nombre de la fuente",null,null,null,"Tipo de fuente",null,null,null,"Nombre de la fuente",null,null,null,"Tipo de fuente",null,null,null,"Nombre de la fuente",null,null,null,"Tipo de fuente"]
[null,"Ej.","Licenciada",null,null,"Guadalupe",null,null,"Hernández",null,null,"García",null,null,"Secretaría de Salud",null,null,null,"Dirección General de Administración",null,null,null,"Directora de Recursos Financieros",null,null,"hernandezg@dgsp.gob.mx",null,null,"I, II.2, I.4.2, P1.25, P1.26",null,null,"Control de nómina que utiliza el área de recursos humanos",null,null,null,3,null,null,null,"Sistema de administración presupuestal y financiero",null,null,null,1,null,null,null,"De palabra",null,null,null,9]
[null,"1.",null,null,null,null,null,null,null,null,null,null,null,null,null,null,null,null,null,null,null,null,null,null,null,null,null,null,null,null,null,null,null,null,null,null,null,null,null,null,null,null,null,null,null,null,null,null,null,null,null,null,null,null,null,null,null,null,null,null,null,null,1,"Sistema Informático propio"]
[null,"2.",null,null,null,null,null,null,null,null,null,null,null,null,null,null,null,null,null,null,null,null,null,null,null,null,null,null,null,null,null,null,null,null,null,null,null,null,null,null,null,null,null,null,null,null,null,null,null,null,null,null,null,null,null,null,null,null,null,null,null,null,2,"Software comercial especializado"]
[null,"3.",null,null,null,null,null,null,null,null,null,null,null,null,null,null,null,null,null,null,null,null,null,null,null,null,null,null,null,null,null,null,null,null,null,null,null,null,null,null,null,null,null,null,null,null,null,null,null,null,null,null,null,null,null,null,null,null,null,null,null,null,3,"Base de datos u hojas de cálculo estructuradas y estandarizadas"]
[null,"4.",null,null,null,null,null,null,null,null,null,null,null,null,null,null,null,null,null,null,null,null,null,null,null,null,null,null,null,null,null,null,null,null,null,null,null,null,null,null,null,null,null,null,null,null,null,null,null,null,null,null,null,null,null,null,null,null,null,null,null,null,4,"Hojas de cálculo no estructuradas o no estandarizadas"]
[null,"5.",null,null,null,null,null,null,null,null,null,null,null,null,null,null,null,null,null,null,null,null,null,null,null,null,null,null,null,null,null,null,null,null,null,null,null,null,null,null,null,null,null,null,null,null,null,null,null,null,null,null,null,null,null,null,null,null,null,null,null,null,5,"Libro de gobierno en formato electrónico"]
[null,"6.",null,null,null,null,null,null,null,null,null,null,null,null,null,null,null,null,null,null,null,null,null,null,null,null,null,null,null,null,null,null,null,null,null,null,null,null,null,null,null,null,null,null,null,null,null,null,null,null,null,null,null,null,null,null,null,null,null,null,null,null,6,"Libro de gobierno en papel"]
[null,"7.",null,null,null,null,null,null,null,null,null,null,null,null,null,null,null,null,null,null,null,null,null,null,null,null,null,null,null,null,null,null,null,null,null,null,null,null,null,null,null,null,null,null,null,null,null,null,null,null,null,null,null,null,null,null,null,null,null,null,null,null,7,"Bitácora en documento de texto electrónico"]
[null,"8.",null,null,null,null,null,null,null,null,null,null,null,null,null,null,null,null,null,null,null,null,null,null,null,null,null,null,null,null,null,null,null,null,null,null,null,null,null,null,null,null,null,null,null,null,null,null,null,null,null,null,null,null,null,null,null,null,null,null,null,null,8,"Bitácora en documento de texto en papel"]
[null,"9.",null,null,null,null,null,null,null,null,null,null,null,null,null,null,null,null,null,null,null,null,null,null,null,null,null,null,null,null,null,null,null,null,null,null,null,null,null,null,null,null,null,null,null,null,null,null,null,null,null,null,null,null,null,null,null,null,null,null,null,null,9,"De palabra"]
[null,"10.",null,null,null,null,null,null,null,null,null,null,null,null,null,null,null,null,null,null,null,null,null,null,null,null,null,null,null,null,null,null,null,null,null,null,null,null,null,null,null,null,null,null,null,null,null,null,null,null,null,null,null,null,null,null,null,null,null,null,null,null,10,"Otra"]
[null,"11."]
[null,"12."]
[null,"13."]
[null,"14."]
[null,"15."]
[null,"16."]
[null,"17."]
[null,"18."]
[null,"19."]
[null,"20."]
[null,"21."]
[null,"22."]
[null,"23."]
[null,"24."]
[null,"25."]
[null,"26."]
[null,"27."]
[null,"28."]
[null,"29."]
[null,"30."]
[null,"31."]
[null,"32."]
[null,"33."]
[null,"34."]
[null,"35."]

{"sheet":"CNGE_2026_M6_Secc2_Sub1","index":4,"n_rows":239,"n_cols":37,"rows_kept":239,"cut":false,"hidden":true,"merged":[[9,1,9,29],[10,1,10,29],[11,2,11,29],[12,2,12,29],[13,2,13,29],[14,2,14,29],[0,1,0,29],[2,1,2,29],[4,1,4,29],[6,26,6,29],[7,1,7,11],[7,13,7,14],[40,2,40,29],[41,2,41,29],[48,1,48,29],[49,2,49,29],[22,2,22,29],[23,2,23,29],[15,2,15,29],[16,2,16,29],[17,2,17,29],[18,2,18,29],[19,2,19,29],[32,3,32,29],[33,3,33,29],[34,3,34,29],[35,3,35,29],[36,3,36,29],[38,2,38,5],[38,6,38,29],[20,1,20,29],[21,2,21,29],[25,1,25,29],[26,2,26,29],[27,2,27,29],[29,3,29,29],[30,3,30,29],[31,3,31,29],[85,3,85,29],[86,3,86,29],[88,2,88,5],[88,6,88,29],[90,2,90,29],[91,2,91,29],[51,2,51,29],[53,2,53,5],[53,6,53,29],[55,2,55,29],[56,2,56,29],[63,1,63,29],[82,3,82,29],[83,3,83,29],[84,3,84,29],[80,2,80,29],[78,1,78,29],[79,2,79,29],[71,2,71,29],[68,2,68,5],[68,6,68,29],[70,2,70,29],[66,2,66,29],[64,2,64,29],[181,3,181,29],[182,3,182,29],[183,3,183,29],[184,3,184,29],[185,3,185,29],[186,3,186,29],[174,1,174,29],[175,2,175,29],[176,2,176,29],[177,2,177,29],[179,3,179,29],[180,3,180,29],[111,3,111,29],[113,2,113,5],[113,6,113,29],[115,2,115,29],[116,2,116,29],[123,1,123,29],[105,3,105,29],[106,3,106,29],[107,3,107,29],[108,3,108,29],[200,2,200,29],[201,2,201,29],[202,2,202,29],[203,2,203,29],[205,2,205,17],[205,18,205,21],[205,22,205,25],[205,26,205,29],[187,3,187,29],[189,2,189,5],[189,6,189,29],[191,2,191,29],[192,2,192,29],[199,1,199,29],[208,3,208,17],[208,18,208,21],[208,22,208,25],[208,26,208,29],[209,3,209,17],[209,18,209,21],[209,22,209,25],[209,26,209,29],[206,3,206,17],[206,18,206,21],[206,22,206,25],[206,26,206,29],[207,3,207,17],[207,18,207,21],[207,22,207,25],[207,26,207,29],[214,2,214,29],[215,2,215,29],[222,1,222,29],[223,2,223,29],[224,2,224,29],[226,2,226,19],[226,20,226,24],[226,25,226,29],[210,3,210,17],[210,18,210,21],[210,22,210,25],[210,26,210,29],[212,2,212,5],[212,6,212,29],[229,25,229,29],[230,3,230,19],[230,20,230,24],[230,25,230,29],[227,3,227,19],[227,20,227,24],[227,25,227,29],[228,3,228,19],[228,20,228,24],[228,25,228,29],[236,2,236,5],[236,6,236,29],[238,2,238,29],[239,2,239,29],[98,1,98,29],[99,2,99,29],[100,2,100,29],[101,2,101,29],[103,3,103,29],[104,3,104,29],[233,3,233,19],[233,20,233,24],[233,25,233,29],[234,3,234,19],[234,20,234,24],[234,25,234,29],[231,3,231,19],[231,20,231,24],[231,25,231,29],[232,3,232,19],[232,20,232,24],[232,25,232,29],[229,3,229,19],[229,20,229,24],[109,3,109,29],[110,3,110,29],[130,3,130,17],[130,18,130,21],[130,22,130,25],[130,26,130,29],[131,3,131,17],[131,18,131,21],[131,22,131,25],[131,26,131,29],[124,2,124,29],[125,2,125,29],[126,2,126,29],[127,2,127,29],[129,2,129,17],[129,18,129,21],[129,22,129,25],[129,26,129,29],[134,3,134,17],[134,18,134,21],[134,22,134,25],[134,26,134,29],[136,2,136,5],[136,6,136,29],[132,3,132,17],[132,18,132,21],[132,22,132,25],[132,26,132,29],[133,3,133,17],[133,18,133,21],[133,22,133,25],[133,26,133,29],[150,2,150,19],[150,20,150,24],[150,25,150,29],[151,3,151,19],[151,20,151,24],[151,25,151,29],[138,2,138,29],[139,2,139,29],[146,1,146,29],[147,2,147,29],[148,2,148,29],[154,3,154,19],[154,20,154,24],[154,25,154,29],[155,3,155,19],[155,20,155,24],[155,25,155,29],[152,3,152,19],[152,20,152,24],[152,25,152,29],[153,3,153,19],[153,20,153,24],[153,25,153,29],[163,2,163,29],[158,3,158,19],[158,20,158,24],[158,25,158,29],[160,2,160,5],[160,6,160,29],[162,2,162,29],[156,3,156,19],[156,20,156,24],[156,25,156,29],[157,3,157,19],[157,20,157,24],[157,25,157,29]]}
[null,"CENSO NACIONAL DE GOBIERNOS\nESTATALES 2026",null,null,null,null,null,null,null,null,null,null,null,null,null,null,null,null,null,null,null,null,null,null,null,null,null,null,null,null,null,null,{"$f":"IF(SUM(AG8)>0,1,0)","v":0}]
[]
[null,"Módulo 6.\nCatastro, registro y territorio"]
[]
[null,"Sección II. Registro Público de la Propiedad"]
[]
[null,"Entidad:",null,null,null,null,null,null,null,null,null,null,null,"Clave:",null,null,null,null,null,null,null,null,null,null,null,null,"Índice"]
[null,{"$f":"IF(Índice!B9=\"\",\"\",Índice!B9)","v":""},null,null,null,null,null,null,null,null,null,null,null,{"$f":"IF(Índice!N9=\"\",\"\",Índice!N9)","v":""},null,null,null,null,null,null,null,null,null,null,null,null,null,null,null,null,null,null,{"$f":"IF(SUM(AG26,AG39,AG49,AG54,AG64,AG69,AG79,AG89,AG99,AG114,AG124,AG130,AH130,AG137,AI152,AI153,AG161)=0,0,1)","v":0}]
[null,null,null,null,null,null,null,null,null,null,null,null,null,null,null,null,null,null,null,null,null,null,null,null,null,null,null,null,null,null,null,null,"No. Ent"]
[null,"II.1 Estructura de la institución registral",null,null,null,null,null,null,null,null,null,null,null,null,null,null,null,null,null,null,null,null,null,null,null,null,null,null,null,null,null,null,32]
[null,"Instrucciones generales para las preguntas de la subsección:",null,null,null,null,null,null,null,null,null,null,null,null,null,null,null,null,null,null,null,null,null,null,null,null,null,null,null,null,null,null,"No. Mun"]
[null,null,"1.- Periodo de referencia de los datos: \nAl cierre del año: la información se refiere a lo existente al 31 de diciembre de 2025.\nDurante el año: la información se refiere a lo existente del 1 de enero al 31 de diciembre de 2025.",null,null,null,null,null,null,null,null,null,null,null,null,null,null,null,null,null,null,null,null,null,null,null,null,null,null,null,null,null,{"$f":"IFERROR(VLOOKUP(B8,listas!A2:AD33,3,0),0)","v":0}]
[null,null,"2.- Los catálogos utilizados en el presente cuestionario corresponden a denominaciones estándar, de tal forma que si el nombre de alguna clasificación no coincide exactamente con la utilizada en su entidad federativa, debe registrar los datos en aquella que sea homóloga. ",null,null,null,null,null,null,null,null,null,null,null,null,null,null,null,null,null,null,null,null,null,null,null,null,null,null,null,null,null,"Aux"]
[null,null,"3.- En caso de que los registros con los que cuente no le permitan desglosar la información de acuerdo con los requerimientos solicitados, anote \"NS\" (No se sabe) en las celdas donde no disponga de información. En el recuadro para comentarios de cada pregunta debe proporcionar una justificación respecto del uso del \"NS\" en determinado reactivo.",null,null,null,null,null,null,null,null,null,null,null,null,null,null,null,null,null,null,null,null,null,null,null,null,null,null,null,null,null,{"$f":"IF(Índice!B9<>\"\",\"X\",\"\")","v":""}]
[null,null,"4.- Las cifras deben anotarse con números enteros y sin espacio de separación ni comas, independientemente de si son miles o millones. En el caso de los porcentajes, estos además deben de ir sin el símbolo %."]
[null,null,"5.- No deje celdas en blanco, salvo en los casos en que la instrucción así lo solicite. ",null,null,null,null,null,null,null,null,null,null,null,null,null,null,null,null,null,null,null,null,null,null,null,null,null,null,null,null,null,"Aux2"]
[null,null,"6.- En el caso de las tablas, deben estar contestadas todas las celdas, ya sea anotando \"0\" (cero), en caso de datos numéricos, o eligiendo algún código según el formato de respuesta.",null,null,null,null,null,null,null,null,null,null,null,null,null,null,null,null,null,null,null,null,null,null,null,null,null,null,null,null,null,{"$f":"IF(Índice!B9=\"\",\"X\",\"\")","v":"X"}]
[null,null,"7.- En las preguntas con listas desplegables, seleccione la opción que corresponda a la realidad de la entidad federativa."]
[null,null,"8.- Antes de concluir el cuestionario, revise que no haya celdas rellenas con color rojo, pues dicho color indica que hay error en la información y debe de corregirse. También asegúrese de que no haya celdas con color amarillo, ya que eso significa que falta una respuesta y debe proporcionarse la información.\t"]
[null,null,"9.- ¡Importante!: recuerde que todos los datos proporcionados en el cuestionario deben corresponder a los asentados en sus registros administrativos."]
[null,"Glosario de la subsección:"]
[null,null,"1.- Administración Pública Estatal Centralizada: se refiere al conjunto de instituciones o dependencias de la Administración Pública de la entidad federativa que, de acuerdo con la ley orgánica respectiva, fueron creadas para el despacho de los negocios de orden administrativo encomendados al Poder Ejecutivo Estatal, tales como: la oficina del(a) Gobernador(a) u homóloga, las secretarías, la consejería jurídica u homóloga y las demás instituciones que la disposición normativa en la materia establezca."]
[null,null,"2.- Administración Pública Estatal Descentralizada: se refiere a la entidad de la administración pública creada por ley o decreto del Congreso o por decreto del Ejecutivo estatal, con personalidad jurídica y patrimonio propio, cualquiera que sea la estructura legal que adopten, constituida con fondos o bienes provenientes de la administración pública estatal. Su objetivo es la prestación de un servicio público o social, la explotación de bienes o recursos propiedad del Estado."]
[null,null,"3.- Administración Pública Estatal Desconcentrada: se refiere a las entidades jerárquicamente subordinadas a las instituciones, con facultades específicas para resolver asuntos en la materia encomendada de conformidad con las disposiciones legales aplicables. Los órganos desconcentrados cuentan con autonomía administrativa, pero no tienen responsabilidad jurídica ni patrimonio propio. Es importante señalar que los recursos ejercidos por los órganos administrativos desconcentrados forman parte del gasto del ramo administrativo que los coordina sectorialmente."]
[]
["2.1.-","Seleccione la denominación general de la institución registral de la entidad federativa durante el año 2025.",null,null,null,null,null,null,null,null,null,null,null,null,null,null,null,null,null,null,null,null,null,null,null,null,null,null,null,null,null,null,{"$f":"IF(AG17=\"\",IF(COUNTBLANK(C30:C37)=8,1,0),0)","v":0}]
[null,null,"Seleccione con \"X\" un solo código. "]
[null,null,"Si marca el numeral 8, anote la otra denominación en el recuadro que se encuentra al final de la lista."]
[]
[null,null,null,"1. Instituto Registral y Catastral "]
[null,null,null,"2. Instituto Catastral y Registral"]
[null,null,null,"3. Instituto Registral"]
[null,null,null,"4. Dirección de Catastro y Registro Público"]
[null,null,null,"5. Dirección General de Registro Público de la Propiedad y Notarías"]
[null,null,null,"6. Dirección General de Registro Público de la Propiedad y de Comercio"]
[null,null,null,"7. Dirección de Registro Público de la Propiedad y de Comercio"]
[null,null,null,"8. Otra (especifique)"]
[]
[null,null,"Otra denominación:\n(especifique)",null,null,null,null,null,null,null,null,null,null,null,null,null,null,null,null,null,null,null,null,null,null,null,null,null,null,null,null,null,{"$f":"IF(UPPER(C37=\"X\"),COUNTBLANK(G39),0)","v":0}]
[]
[null,null,"En caso de tener algún comentario u observación al dato registrado en la respuesta de la presente pregunta, o de los datos que derivan de la misma, favor de anotarlo en el siguiente espacio. De lo contrario, déjelo en blanco."]
[]
[]
[]
[]
[]
[]
[]
["2.2.-","Seleccione de la lista desplegable el nombre oficial del área o institución que realizó exclusivamente la actividad registral en la entidad federativa durante el año 2025.",null,null,null,null,null,null,null,null,null,null,null,null,null,null,null,null,null,null,null,null,null,null,null,null,null,null,null,null,null,null,{"$f":"IF(AG17=\"\",COUNTBLANK(C52),0)","v":0}]
[null,null,"Si elige la opción \"Otro\", anote el otro nombre oficial en el recuadro que se encuentra después de la lista desplegable."]
[]
[]
[]
[null,null,"Otro nombre oficial:\n(especifique)",null,null,null,null,null,null,null,null,null,null,null,null,null,null,null,null,null,null,null,null,null,null,null,null,null,null,null,null,null,{"$f":"IF(UPPER(C52=\"OTRO\"),COUNTBLANK(G54),0)","v":0}]
[]
[null,null,"En caso de tener algún comentario u observación al dato registrado en la respuesta de la presente pregunta, o de los datos que derivan de la misma, favor de anotarlo en el siguiente espacio. De lo contrario, déjelo en blanco."]
[]
[]
[]
[]
[]
[]
[]
["2.3.-","Seleccione de la lista desplegable el nombre oficial de la institución a la que estuvo adscrita durante el año 2025 el área o institución que eligió en la pregunta 2.2.",null,null,null,null,null,null,null,null,null,null,null,null,null,null,null,null,null,null,null,null,null,null,null,null,null,null,null,null,null,null,{"$f":"IF(AG17=\"\",COUNTBLANK(C67),0)","v":0}]
[null,null,"Si elige la opción \"Otro\", anote el otro nombre oficial en el recuadro que se encuentra después de la lista desplegable."]
[]
[]
[]
[null,null,"Otro nombre oficial:\n(especifique)",null,null,null,null,null,null,null,null,null,null,null,null,null,null,null,null,null,null,null,null,null,null,null,null,null,null,null,null,null,{"$f":"IF(UPPER(C67=\"OTRO\"),COUNTBLANK(G69),0)","v":0}]
[]
[null,null,"En caso de tener algún comentario u observación al dato registrado en la respuesta de la presente pregunta, o de los datos que derivan de la misma, favor de anotarlo en el siguiente espacio. De lo contrario, déjelo en blanco."]
[]
[]
[]
[]
[]
[]
[]
["2.4.-","Seleccione la clasificación administrativa que tuvo la institución registral de la entidad federativa durante el año 2025.",null,null,null,null,null,null,null,null,null,null,null,null,null,null,null,null,null,null,null,null,null,null,null,null,null,null,null,null,null,null,{"$f":"IF(AG17=\"\",IF(COUNTBLANK(C83:C87)=5,1,0),0)","v":0}]
[null,null,"Seleccione con \"X\" un solo código."]
[null,null,"Si marca el numeral 4, anote la otra clasificación administrativa en el recuadro que se encuentra al final de la lista."]
[]
[null,null,null,"1. Desconcentrada"]
[null,null,null,"2. Descentralizada"]
[null,null,null,"3. Centralizada"]
[null,null,null,"4. Otra (especifique)"]
[null,null,null,"9. No se sabe"]
[]
[null,null,"Otra clasificación administrativa:\n(especifique)",null,null,null,null,null,null,null,null,null,null,null,null,null,null,null,null,null,null,null,null,null,null,null,null,null,null,null,null,null,{"$f":"IF(UPPER(C86=\"X\"),COUNTBLANK(G89),0)","v":0}]
[null,null,null,null,null," "]
[null,null,"En caso de tener algún comentario u observación al dato registrado en la respuesta de la presente pregunta, o de los datos que derivan de la misma, favor de anotarlo en el siguiente espacio. De lo contrario, déjelo en blanco."]
[]
[]
[]
[]
[]
[]
[]
["2.5.-","Seleccione las actividades que registró la institución registral de la entidad federativa durante el año 2025.",null,null,null,null,null,null,null,null,null,null,null,null,null,null,null,null,null,null,null,null,null,null,null,null,null,null,null,null,null,null,{"$f":"IF(AG17=\"\",IF(COUNTBLANK(C104:C112)=9,1,0),0)","v":0}]
[null,null,"Puede seleccionar con \"X\" más de un código."]
[null,null,"Si marca el numeral 8, anote la otra actividad en el recuadro que se encuentra al final de la lista."]
[null,null,"Si elige el numeral 9, no marque otro código."]
[]
[null,null,null,"1. Inmobiliaria"]
[null,null,null,"2. Mercantil"]
[null,null,null,"3. Mobiliaria"]
[null,null,null,"4. Personas morales de carácter civil"]
[null,null,null,"5. Testamentaria "]
[null,null,null,"6. Desarrollo urbano "]
[null,null,null,"7. Notarial"]
[null,null,null,"8. Otra (especifique)"]
[null,null,null,"9. No se sabe"]
[]
[null,null,"Otra actividad:\n(especifique)",null,null,null,null,null,null,null,null,null,null,null,null,null,null,null,null,null,null,null,null,null,null,null,null,null,null,null,null,null,{"$f":"IF(UPPER(C111=\"X\"),COUNTBLANK(G114),0)","v":0}]
[]
[null,null,"En caso de tener algún comentario u observación al dato registrado en la respuesta de la presente pregunta, o de los datos que derivan de la misma, favor de anotarlo en el siguiente espacio. De lo contrario, déjelo en blanco."]
[null,null,null,null,null,null,null,null,null,null,null,null,null,null,null,null,null,null,null,null,null,null,null,null,null,null,null,null,null,null,null,null,null,null,null,null,0]
[]
[]
[]
[]
[]
[]
["2.6.-","Indique si al cierre del año 2025 existieron las siguientes oficinas registrales en la entidad federativa.",null,null,null,null,null,null,null,null,null,null,null,null,null,null,null,null,null,null,null,null,null,null,null,null,null,null,null,null,null,null,{"$f":"IF(AG17=\"\",IF(AND(S131=1,OR(AA131=\"\",W131=\"\")),1,0)+IF(AND(S132=1,OR(AA132=\"\",W132=\"\")),1,0)+IF(AND(S133=1,OR(AA133=\"\",W133=\"\")),1,0)+IF(AND(S134=1,OR(AA134=\"\",W134=\"\")),1,0)+IF(AND(S135=1,OR(AA135=\"\",W135=\"\")),1,0)+COUNTBLANK(S131:S135),0)","v":0}]
[null,null,"Si responde \"1. Sí\" en el numeral \"1. Únicamente oficina registral estatal\", responda \"2. No\" en los numerales 2 a 5 y pase a la pregunta 2.8."]
[null,null,"Si responde \"1. Sí\" en el numeral \"2. Oficina central\" pero esta no atendió municipios, sino que fungió como oficina de coordinación, registre cero en la columna \"Cantidad de municipios atendidos\"."]
[null,null,"Para la clasificación de las oficinas registrales se utilizan las denominaciones estándar \"Oficinas en las cabeceras regionales\" y \"Oficinas en las cabeceras de distritos judiciales\", por lo que si el nombre no coincide exactamente con las oficinas existentes en su institución, debe anotar los datos en aquella que sea homóloga. "]
[null,null,"Si responde \"1. Sí\" en el numeral 5, anote el otro tipo de oficina en el recuadro que se encuentra al final de la tabla."]
[]
[null,null,"Tipo de oficina",null,null,null,null,null,null,null,null,null,null,null,null,null,null,null,"¿Existieron? \n(1.Sí / 2.No / \n9.No se sabe)",null,null,null,"Cantidad de oficinas",null,null,null,"Cantidad de municipios atendidos"]
[null,null,"1.","Únicamente oficina registral estatal"]
[null,null,"2.","Oficina central",null,null,null,null,null,null,null,null,null,null,null,null,null,null,null,null,null,null,null,null,null,null,null,null,null,null,null,null,{"$f":"IF(S132=1,AG12,0)","v":0}]
[null,null,"3.","Oficinas en las cabeceras regionales",null,null,null,null,null,null,null,null,null,null,null,null,null,null,null,null,null,null,null,null,null,null,null,null,null,null,null,null,{"$f":"IF(S133=1,AG12,0)","v":0}]
[null,null,"4.","Oficinas en las cabeceras de distritos judiciales",null,null,null,null,null,null,null,null,null,null,null,null,null,null,null,null,null,null,null,null,null,null,null,null,null,null,null,null,{"$f":"IF(S134=1,AG12,0)","v":0}]
[null,null,"5.","Otro (especifique)",null,null,null,null,null,null,null,null,null,null,null,null,null,null,null,null,null,null,null,null,null,null,null,null,null,null,null,null,{"$f":"IF(S135=1,AG12,0)","v":0}]
[]
[null,null,"Otro tipo de oficina:\n(especifique)",null,null,null,null,null,null,null,null,null,null,null,null,null,null,null,null,null,null,null,null,null,null,null,null,null,null,null,null,null,{"$f":"IF(S135=1,COUNTBLANK(G137),0)","v":0}]
[]
[null,null,"En caso de tener algún comentario u observación al dato registrado en la respuesta de la presente pregunta, o de los datos que derivan de la misma, favor de anotarlo en el siguiente espacio. De lo contrario, déjelo en blanco."]
[]
[]
[]
[]
[]
[]
[]
["2.7.-","Indique si los siguientes elementos de la función registral existieron en las oficinas en las cabeceras regionales y/ o en las oficinas en las cabeceras de distritos judiciales durante el año 2025."]
[null,null,"Si al menos en una oficina existió el elemento, responda afirmativamente."]
[null,null,"Si responde \"1. Sí\" en el numeral 8, anote el otro elemento en el recuadro que se encuentra al final de la tabla."]
[]
[null,null,"Elemento",null,null,null,null,null,null,null,null,null,null,null,null,null,null,null,null,null,"¿Existió\nen oficinas en las cabeceras regionales?                (1.Sí / 2.No / 9.No se sabe)",null,null,null,null,"¿Existió\nen oficinas en las cabeceras de distritos judiciales? (1.Sí / 2.No / 9.No se sabe)"]
[null,null,"1.","Trámites y servicios",null,null,null,null,null,null,null,null,null,null,null,null,null,null,null,null,null,null,null,null,null,null,null,null,null,null,null,null,{"$f":"IF(S133=1,\"\",\"X\")","v":"X"},{"$f":"IF(S133=1,IF(COUNTBLANK(U152:U159)>0,1,0),0)","v":0},{"$f":"IF(S133=1,IF(COUNTBLANK(U152:U159)>0,1,0),0)","v":0}]
[null,null,2,"Folio real físico ",null,null,null,null,null,null,null,null,null,null,null,null,null,null,null,null,null,null,null,null,null,null,null,null,null,null,null,null,{"$f":"IF(S134=1,\"\",\"X\")","v":"X"},{"$f":"IF(S134=1,IF(COUNTBLANK(Z152:Z159)>0,1,0),0)","v":0},{"$f":"IF(S134=1,IF(COUNTBLANK(Z152:Z159)>0,1,0),0)","v":0}]
[null,null,"3.","Folio real electrónico"]
[null,null,"4.","Sistema de gestión registral"]
[null,null,"5.","Servicios electrónicos"]
[null,null,"6.","Firma electrónica"]
[null,null,"7.","Medidas de seguridad para el resguardo del acervo documental"]
[null,null,"8.","Otro (especifique)"]
[]
[null,null,"Otro elemento:\n(especifique)",null,null,null,null,null,null,null,null,null,null,null,null,null,null,null,null,null,null,null,null,null,null,null,null,null,null,null,null,null,{"$f":"IF(OR(U159=1, Z159=1),COUNTBLANK(G161),0)","v":0}]
[]
[null,null,"En caso de tener algún comentario u observación al dato registrado en la respuesta de la presente pregunta, o de los datos que derivan de la misma, favor de anotarlo en el siguiente espacio. De lo contrario, déjelo en blanco."]
[]
[]
[]
[]
[]
[]
[]
[]
[]
[]
[]
["2.5.-","Seleccione las actividades que registró la institución registral de la entidad federativa durante el año 2025."]
[null,null,"Puede seleccionar con \"X\" más de un código."]
[null,null,"Si marca el numeral 8, anote la otra actividad en el recuadro que se encuentra al final de la lista."]
[null,null,"Si elige el numeral 9, no marque otro código."]
[]
[null,null,null,"1. Inmobiliaria"]
[null,null,null,"2. Mercantil"]
[null,null,null,"3. Mobiliaria"]
[null,null,null,"4. Personas morales de carácter civil"]
[null,null,null,"5. Testamentaria "]
[null,null,null,"6. Desarrollo urbano "]
[null,null,null,"7. Notarial"]
[null,null,null,"8. Otra (especifique)"]
[null,null,null,"9. No se sabe"]
[]
[null,null,"Otra actividad:\n(especifique)"]
[]
[null,null,"En caso de tener algún comentario u observación al dato registrado en la respuesta de la presente pregunta, o de los datos que derivan de la misma, favor de anotarlo en el siguiente espacio. De lo contrario, déjelo en blanco."]
[]
[]
[]
[]
[]
[]
[]
["2.6.-","Indique si al cierre del año 2025 existieron las siguientes oficinas registrales en la entidad federativa."]
[null,null,"Si responde \"1. Sí\" en el numeral \"1. Únicamente oficina registral estatal\", responda \"2. No\" en los numerales 2 a 5 y pase a la pregunta 2.8."]
[null,null,"Si responde \"1. Sí\" en el numeral \"2. Oficina central\" pero esta no atendió municipios, sino que fungió como oficina de coordinación, registre cero en la columna \"Cantidad de municipios atendidos\"."]
[null,null,"Para la clasificación de las oficinas registrales se utilizan las denominaciones estándar \"Oficinas en las cabeceras regionales\" y \"Oficinas en las cabeceras de distritos judiciales\", por lo que si el nombre no coincide exactamente con las oficinas existentes en su institución, debe anotar los datos en aquella que sea homóloga. "]
[null,null,"Si responde \"1. Sí\" en el numeral 5, anote el otro tipo de oficina en el recuadro que se encuentra al final de la tabla."]
[]
[null,null,"Tipo de oficina",null,null,null,null,null,null,null,null,null,null,null,null,null,null,null,"¿Existieron? \n(1.Sí / 2.No / \n9.No se sabe)",null,null,null,"Cantidad de oficinas",null,null,null,"Cantidad de municipios atendidos"]
[null,null,"1.","Únicamente oficina registral estatal"]
[null,null,"2.","Oficina central"]
[null,null,"3.","Oficinas en las cabeceras regionales"]
[null,null,"4.","Oficinas en las cabeceras de distritos judiciales"]
[null,null,"5.","Otro (especifique)"]
[]
[null,null,"Otro tipo de oficina:\n(especifique)"]
[]
[null,null,"En caso de tener algún comentario u observación al dato registrado en la respuesta de la presente pregunta, o de los datos que derivan de la misma, favor de anotarlo en el siguiente espacio. De lo contrario, déjelo en blanco."]
[]
[]
[]
[]
[]
[]
[]
["2.7.-","Indique si los siguientes elementos de la función registral existieron en las oficinas en las cabeceras regionales y/ o en las oficinas en las cabeceras de distritos judiciales durante el año 2025."]
[null,null,"Si al menos en una oficina existió el elemento, responda afirmativamente."]
[null,null,"Si responde \"1. Sí\" en el numeral 8, anote el otro elemento en el recuadro que se encuentra al final de la tabla."]
[]
[null,null,"Elemento",null,null,null,null,null,null,null,null,null,null,null,null,null,null,null,null,null,"¿Existió\nen oficinas en las cabeceras regionales?                (1.Sí / 2.No / 9.No se sabe)",null,null,null,null,"¿Existió\nen oficinas en las cabeceras de distritos judiciales? (1.Sí / 2.No / 9.No se sabe)"]
[null,null,"1.","Trámites y servicios"]
[null,null,2,"Folio real físico "]
[null,null,"3.","Folio real electrónico"]
[null,null,"4.","Sistema de gestión registral"]
[null,null,"5.","Servicios electrónicos"]
[null,null,"6.","Firma electrónica"]
[null,null,"7.","Medidas de seguridad para el resguardo del acervo documental"]
[null,null,"8.","Otro (especifique)"]
[]
[null,null,"Otro elemento:\n(especifique)"]
[]
[null,null,"En caso de tener algún comentario u observación al dato registrado en la respuesta de la presente pregunta, o de los datos que derivan de la misma, favor de anotarlo en el siguiente espacio. De lo contrario, déjelo en blanco."]

{"sheet":"CNGE_2026_M6_Secc2_Sub2","index":5,"n_rows":261,"n_cols":34,"rows_kept":261,"cut":false,"hidden":true,"merged":[[116,3,116,14],[116,15,116,19],[116,20,116,24],[116,25,116,29],[258,2,258,5],[258,6,258,29],[260,2,260,29],[261,2,261,29],[255,3,255,14],[255,15,255,19],[255,20,255,24],[255,25,255,29],[256,3,256,14],[256,15,256,19],[256,20,256,24],[256,25,256,29],[253,3,253,14],[253,15,253,19],[253,20,253,24],[253,25,253,29],[254,3,254,14],[254,15,254,19],[254,20,254,24],[254,25,254,29],[251,3,251,14],[251,15,251,19],[251,20,251,24],[251,25,251,29],[252,3,252,14],[252,15,252,19],[252,20,252,24],[252,25,252,29],[249,3,249,14],[249,15,249,19],[249,20,249,24],[249,25,249,29],[250,3,250,14],[250,15,250,19],[250,20,250,24],[250,25,250,29],[247,2,247,14],[247,15,247,19],[247,20,247,24],[247,25,247,29],[248,3,248,14],[248,15,248,19],[248,20,248,24],[248,25,248,29],[231,2,231,29],[235,2,235,29],[236,2,236,29],[243,1,243,29],[244,2,244,29],[245,2,245,29],[210,2,210,29],[217,1,217,29],[218,2,218,29],[222,2,222,29],[223,2,223,29],[230,1,230,29],[205,18,205,21],[205,22,205,25],[205,26,205,29],[207,2,207,5],[207,6,207,29],[209,2,209,29],[204,2,204,3],[204,4,204,12],[204,13,204,17],[204,18,204,21],[204,22,204,25],[204,26,204,29],[203,2,203,3],[203,4,203,12],[203,13,203,17],[203,18,203,21],[203,22,203,25],[203,26,203,29],[202,2,202,3],[202,4,202,12],[202,13,202,17],[202,18,202,21],[202,22,202,25],[202,26,202,29],[201,2,201,3],[201,4,201,12],[201,13,201,17],[201,18,201,21],[201,22,201,25],[201,26,201,29],[200,2,200,3],[200,4,200,12],[200,13,200,17],[200,18,200,21],[200,22,200,25],[200,26,200,29],[196,2,198,3],[196,5,196,12],[196,13,196,17],[196,18,196,21],[196,22,196,25],[196,26,196,29],[197,5,197,12],[197,13,197,17],[199,2,199,3],[199,4,199,12],[199,13,199,17],[199,18,199,21],[199,22,199,25],[199,26,199,29],[197,18,197,21],[197,22,197,25],[197,26,197,29],[198,5,198,12],[198,13,198,17],[198,18,198,21],[198,22,198,25],[198,26,198,29],[193,2,193,3],[193,4,193,12],[193,13,193,17],[193,18,193,21],[193,22,193,25],[193,26,193,29],[194,2,195,3],[194,5,194,12],[194,13,194,17],[194,18,194,21],[194,22,194,25],[194,26,194,29],[195,5,195,12],[195,13,195,17],[195,18,195,21],[195,22,195,25],[195,26,195,29],[190,26,190,29],[191,5,191,12],[191,13,191,17],[191,18,191,21],[191,22,191,25],[191,26,191,29],[189,2,192,3],[189,5,189,12],[189,13,189,17],[189,18,189,21],[189,22,189,25],[189,26,189,29],[190,5,190,12],[190,13,190,17],[190,18,190,21],[190,22,190,25],[192,5,192,12],[192,13,192,17],[192,18,192,21],[192,22,192,25],[192,26,192,29],[188,2,188,3],[188,4,188,12],[188,13,188,17],[188,18,188,21],[188,22,188,25],[188,26,188,29],[187,2,187,3],[187,4,187,12],[187,13,187,17],[187,18,187,21],[187,22,187,25],[187,26,187,29],[186,2,186,3],[186,4,186,12],[186,13,186,17],[186,18,186,21],[186,22,186,25],[186,26,186,29],[185,2,185,3],[185,4,185,12],[185,13,185,17],[185,18,185,21],[185,22,185,25],[185,26,185,29],[181,2,181,29],[183,2,184,12],[183,13,184,17],[183,18,184,21],[183,22,183,29],[184,22,184,25],[184,26,184,29],[169,2,169,29],[170,2,170,29],[177,1,177,29],[178,2,178,29],[179,2,179,29],[180,2,180,29],[166,3,166,14],[166,15,166,19],[166,20,166,24],[166,25,166,29],[167,15,167,19],[167,20,167,24],[167,25,167,29],[164,3,164,14],[164,15,164,19],[164,20,164,24],[164,25,164,29],[165,3,165,14],[165,15,165,19],[165,20,165,24],[165,25,165,29],[162,3,162,14],[162,15,162,19],[162,20,162,24],[162,25,162,29],[163,3,163,14],[163,15,163,19],[163,20,163,24],[163,25,163,29],[160,3,160,14],[160,15,160,19],[160,20,160,24],[160,25,160,29],[161,3,161,14],[161,15,161,19],[161,20,161,24],[161,25,161,29],[158,3,158,14],[158,15,158,19],[158,20,158,24],[158,25,158,29],[159,3,159,14],[159,15,159,19],[159,20,159,24],[159,25,159,29],[145,2,145,29],[146,2,146,29],[153,1,153,29],[154,2,154,29],[156,2,157,14],[156,15,157,19],[156,20,156,29],[157,20,157,24],[157,25,157,29],[142,3,142,14],[142,15,142,19],[142,20,142,24],[142,25,142,29],[143,15,143,19],[143,20,143,24],[143,25,143,29],[140,3,140,14],[140,15,140,19],[140,20,140,24],[140,25,140,29],[141,3,141,14],[141,15,141,19],[141,20,141,24],[141,25,141,29],[138,3,138,14],[138,15,138,19],[138,20,138,24],[138,25,138,29],[139,3,139,14],[139,15,139,19],[139,20,139,24],[139,25,139,29],[136,3,136,14],[136,15,136,19],[136,20,136,24],[136,25,136,29],[137,3,137,14],[137,15,137,19],[137,20,137,24],[137,25,137,29],[133,2,134,14],[133,15,134,19],[133,20,133,29],[134,20,134,24],[134,25,134,29],[135,3,135,14],[135,15,135,19],[135,20,135,24],[135,25,135,29],[120,2,120,5],[120,6,120,29],[122,2,122,29],[123,2,123,29],[130,1,130,29],[131,2,131,29],[117,3,117,14],[117,15,117,19],[117,20,117,24],[117,25,117,29],[118,15,118,19],[118,20,118,24],[118,25,118,29],[114,3,114,14],[114,15,114,19],[114,20,114,24],[114,25,114,29],[115,3,115,14],[115,15,115,19],[115,20,115,24],[115,25,115,29],[112,3,112,14],[112,15,112,19],[112,20,112,24],[112,25,112,29],[113,3,113,14],[113,15,113,19],[113,20,113,24],[113,25,113,29],[110,3,110,14],[110,15,110,19],[110,20,110,24],[110,25,110,29],[111,3,111,14],[111,15,111,19],[111,20,111,24],[111,25,111,29],[105,2,105,29],[106,2,106,29],[108,2,109,14],[108,15,109,19],[108,20,108,29],[109,20,109,24],[109,25,109,29],[90,2,90,5],[92,4,92,7],[94,4,94,7],[96,2,96,29],[97,2,97,29],[104,1,104,29],[78,3,78,10],[78,12,78,19],[78,21,78,29],[80,2,80,29],[81,2,81,29],[88,1,88,29],[76,3,76,10],[76,12,76,19],[76,21,76,29],[77,3,77,10],[77,12,77,19],[77,21,77,29],[73,2,73,29],[74,3,74,10],[74,12,74,19],[74,21,74,29],[75,3,75,10],[75,12,75,19],[75,21,75,29],[67,10,68,14],[67,15,67,29],[69,3,69,9],[69,10,69,14],[71,2,71,5],[71,6,71,29],[54,2,54,29],[55,2,55,29],[62,1,62,29],[63,2,63,29],[64,2,64,29],[65,2,65,29],[42,2,42,29],[49,1,49,29],[51,12,51,17],[51,18,51,23],[51,24,51,29],[52,3,52,11],[52,12,52,17],[52,18,52,23],[52,24,52,29],[38,10,38,15],[38,17,38,22],[39,3,39,8],[39,10,39,15],[39,17,39,22],[41,2,41,29],[35,2,35,29],[36,3,36,8],[36,10,36,15],[36,17,36,22],[36,24,36,29],[37,3,37,8],[37,10,37,15],[37,17,37,22],[37,23,39,29],[38,3,38,8],[32,3,32,7],[32,10,32,15],[32,17,32,22],[32,24,32,29],[33,10,33,15],[33,17,33,22],[33,24,33,29],[30,2,30,7],[30,9,30,29],[31,3,31,7],[31,10,31,15],[31,17,31,22],[31,24,31,29],[27,27,27,29],[28,3,28,9],[28,10,28,14],[28,15,28,17],[28,18,28,20],[28,21,28,23],[28,24,28,26],[28,27,28,29],[21,2,21,29],[22,2,22,29],[23,2,23,29],[25,1,25,29],[27,2,27,9],[27,10,27,14],[27,15,27,17],[27,18,27,20],[27,21,27,23],[27,24,27,26],[18,2,18,29],[19,2,19,29],[20,2,20,29],[9,1,9,29],[10,1,10,29],[11,2,11,29],[12,2,12,29],[13,2,13,29],[14,2,14,29],[0,1,0,29],[2,1,2,29],[4,1,4,29],[6,26,6,29],[7,1,7,11],[7,13,7,14],[15,2,15,29],[16,2,16,29],[17,2,17,29]]}
[" ","CENSO NACIONAL DE GOBIERNOS\nESTATALES 2026",null,null,null,null,null,null,null,null,null,null,null,null,null,null,null,null,null,null,null,null,null,null,null,null,null,null,null,null,null,null,{"$f":"IF(SUM(AG10)>0,1,0)","v":0}]
[]
[null,"Módulo 6.\nCatastro, registro y territorio"]
[]
[null,"Sección II. Registro Público de la Propiedad"]
[]
[null,"Entidad:",null,null,null,null,null,null,null,null,null,null,null,"Clave:",null,null,null,null,null,null,null,null,null,null,null,null,"Índice"]
[null,{"$f":"IF(Índice!B9=\"\",\"\",Índice!B9)","v":""},null,null,null,null,null,null,null,null,null,null,null,{"$f":"IF(Índice!N9=\"\",\"\",Índice!N9)","v":""}]
[]
[null,"II.2 Recursos humanos y capacitación",null,null,null,null,null,null,null,null,null,null,null,null,null,null,null,null,null,null,null,null,null,null,null,null,null,null,null,null,null,null,{"$f":"IF(SUM(AG26,AG27,AG29,AG50,AG53,AG63,AG72,AG89,AG91,AG105,AG121,AG131,AG154,AG178,AG208,AG218,AG231,AG244,AG259)=0,0,1)","v":0}]
[null,"Instrucciones generales para las preguntas de la subsección:"]
[null,null,"1.- Periodo de referencia de los datos: \nAl cierre del año: la información se refiere a lo existente al 31 de diciembre de 2025.\nDurante el año: la información se refiere a lo existente del 1 de enero al 31 de diciembre de 2025."]
[null,null,"2.- Los catálogos utilizados en el presente cuestionario corresponden a denominaciones estándar, de tal forma que si el nombre de alguna clasificación no coincide exactamente con la utilizada en su entidad federativa, debe registrar los datos en aquella que sea homóloga. "]
[null,null,"3.- En caso de que los registros con los que cuente no le permitan desglosar la información de acuerdo con los requerimientos solicitados, anote \"NS\" (No se sabe) en las celdas donde no disponga de información. En el recuadro para comentarios de cada pregunta debe proporcionar una justificación respecto del uso del \"NS\" en determinado reactivo."]
[null,null,"4.- Las cifras deben anotarse con números enteros y sin espacio de separación ni comas, independientemente de si son miles o millones. En el caso de los porcentajes, estos además deben de ir sin el símbolo %."]
[null,null,"5.- No deje celdas en blanco, salvo en los casos en que la instrucción así lo solicite. ",null,null,null,null,null,null,null,null,null,null,null,null,null,null,null,null,null,null,null,null,null,null,null,null,null,null,null,null,null,"Aux"]
[null,null,"6.- En el caso de las tablas, deben estar contestadas todas las celdas, ya sea anotando \"0\" (cero), en caso de datos numéricos, o eligiendo algún código según el formato de respuesta.",null,null,null,null,null,null,null,null,null,null,null,null,null,null,null,null,null,null,null,null,null,null,null,null,null,null,null,null,null,{"$f":"IF(Índice!B9=\"\",\"X\",\"\")","v":"X"}]
[null,null,"7.- En las preguntas con listas desplegables, seleccione la opción que corresponda a la realidad de la entidad federativa."]
[null,null,"8.- Antes de concluir el cuestionario, revise que no haya celdas rellenas con color rojo, pues dicho color indica que hay error en la información y debe de corregirse. También asegúrese de que no haya celdas con color amarillo, ya que eso significa que falta una respuesta y debe proporcionarse la información.\t"]
[null,null,"9.- ¡Importante!: recuerde que todos los datos proporcionados en el cuestionario deben corresponder a los asentados en sus registros administrativos."]
[null,null,"10.- Si la institución encargada de la actividad registral forma parte de una institución con otras actividades, como catastral, notarial, territorial, entre otras; registre únicamente los datos del titular de la institución encargada de la actividad registral."]
[null,null,"11.- Si la o el titular de la institución tiene menos de un año en el cargo, registre \"1\" (uno) en la columna \"Antigüedad en el cargo\"."]
[null,null,"12.- Para la cantidad total de personal, considere al que únicamente realizó funciones registrales. Si llevó a cabo funciones de tipo catastral, notarial o territorial a la par de registral, no deben ser considerados."]
[null,null,"13.- Para las cantidades totales de personal capacitado por tema, contabilice solamente una vez a aquellas que tomaron más de un curso sobre el mismo tema. "]
[null,null,null,null,null,null,null,null,null,null,null,null,null,null,null,null,null,null,null,null,null,null,null,null,null,null,null,null,null,null,null,null,{"$f":"CNGE_2026_M6_Secc2_Sub1!C52","v":0}]
["2.8.-","Enliste los datos de la o el titular de la institución registral durante el año 2025.",null,null,null,null,null,null,null,null,null,null,null,null,null,null,null,null,null,null,null,null,null,null,null,null,null,null,null,null,null,null,{"$f":"IF(AG17=\"\",IF(AG25<>\"\",IF(COUNTBLANK(D29)=1,1,0),0),0)","v":0}]
[null,null,null,null,null,null,null,null,null,null,null,null,null,null,null,null,null,null,null,null,null,null,null,null,null,null,null,null,null,null,null,null,{"$f":"IF(D29<>\"\",IF(COUNTBLANK(K29)+COUNTBLANK(P29)+COUNTBLANK(S29)+COUNTBLANK(V29)+COUNTBLANK(Y29)+COUNTBLANK(AB29)>0,1,0 ),0)","v":0}]
[null,null,"Nombre oficial de la institución registral",null,null,null,null,null,null,null,"Cargo de la o el titular",null,null,null,null,"Sexo\n(ver catálogo)",null,null,"Edad \n(años)",null,null,"Nivel de escolaridad\n(ver catálogo)",null,null,"Antigüedad en el cargo\n(años)",null,null,"Empleo anterior\n(ver catálogo)"]
[null,null,"1."]
[]
[null,null,"Catálogo de sexo",null,null,null,null,null,null,"Catálogo de nivel de escolaridad"]
[null,null,"1.","Hombre",null,null,null,null,null,"1.","Ninguno",null,null,null,null,null,"4.","Preparatoria",null,null,null,null,null,"7.","Maestría"]
[null,null,"2.","Mujer",null,null,null,null,null,"2.","Preescolar o primaria",null,null,null,null,null,"5.","Carrera técnica o carrera comercial",null,null,null,null,null,"8.","Doctorado"]
[null,null,null,null,null,null,null,null,null,"3.","Secundaria",null,null,null,null,null,"6.","Licenciatura",null,null,null,null,null,"9.","No se sabe"]
[]
[null,null,"Catálogo de empleo anterior"]
[null,null,"1.","Gobierno federal",null,null,null,null,null,"5.","Empleada o empleado del sector privado",null,null,null,null,null,"9.","Sector social\n(Organizaciones de la sociedad civil)",null,null,null,null,null,"99.","No se sabe"]
[null,null,"2.","Gobierno estatal",null,null,null,null,null,"6.","Cargo de elección popular",null,null,null,null,null,"10.","Academia\n(Profesora o profesor/ investigadora o investigador de tiempo completo)"]
[null,null,"3.","Gobierno municipal",null,null,null,null,null,"7.","Representación sindical",null,null,null,null,null,"11.","Es primer trabajo"]
[null,null,"4.","Negocio propio",null,null,null,null,null,"8.","Cargo en partido político",null,null,null,null,null,"12.","Otro"]
[]
[null,null,"En caso de tener algún comentario u observación al dato registrado en la respuesta de la presente pregunta, o de los datos que derivan de la misma, favor de anotarlo en el siguiente espacio. De lo contrario, déjelo en blanco."]
[]
[]
[]
[]
[]
[]
[]
["2.9.-","Indique la experiencia técnica de la o el titular de la institución registral en la función notarial.",null,null,null,null,null,null,null,null,null,null,null,null,null,null,null,null,null,null,null,null,null,null,null,null,null,null,null,null,null,null,{"$f":"IF(AG17=\"\",IF(M53=1,IF(COUNTBLANK(S53)+COUNTBLANK(Y53)>0,1,0),0)+COUNTBLANK(M53),0)","v":0}]
[]
[null,null,null,null,null,null,null,null,null,null,null,null,"¿Ejerció la función notarial?\n(1.Sí / 2.No / \n9.No se sabe)",null,null,null,null,null,"¿Cuánto tiempo?\n(Años)",null,null,null,null,null,"¿En qué entidad federativa?"]
[null,null,"1.","Titular de la institución registral"]
[]
[null,null,"En caso de tener algún comentario u observación al dato registrado en la respuesta de la presente pregunta, o de los datos que derivan de la misma, favor de anotarlo en el siguiente espacio. De lo contrario, déjelo en blanco."]
[]
[]
[]
[]
[]
[]
[]
["2.10.-","Indique la experiencia técnica de la o el titular de la institución registral en las siguientes actividades registrales.",null,null,null,null,null,null,null,null,null,null,null,null,null,null,null,null,null,null,null,null,null,null,null,null,null,null,null,null,null,null,{"$f":"IF(AG17=\"\",IF(K70=1,IF(COUNTBLANK(P70:AD70)=15,1,0),0)+COUNTBLANK(K70),0)","v":0}]
[null,null,"Puede seleccionar con \"X\" más de un tipo de actividad."]
[null,null,"Si selecciona el numeral 14, anote la otra actividad en el recuadro que está al final de la tabla."]
[null,null,"Si selecciona el numeral 99, no marque otra columna."]
[]
[null,null,null,null,null,null,null,null,null,null,"¿Tuvo experiencia técnica?\n(1.Sí / 2.No / \n9.No se sabe)",null,null,null,null,"Actividad\n(ver catálogo)"]
[null,null,null,null,null,null,null,null,null,null,null,null,null,null,null,1,2,3,4,5,6,7,8,9,10,11,12,13,14,99]
[null,null,"1.","Titular de la institución registral"]
[]
[null,null,"Otra actividad:\n(especifique)",null,null,null,null,null,null,null,null,null,null,null,null,null,null,null,null,null,null,null,null,null,null,null,null,null,null,null,null,null,{"$f":"IF(UPPER(AC70=\"X\"),COUNTBLANK(G72),0)","v":0}]
[]
[null,null,"Catálogo de tipo de actividad"]
[null,null,"1.","Calificadora o calificador",null,null,null,null,null,null,null,"6.","Inspectora o inspector registral",null,null,null,null,null,null,null,"11.","Revisora o revisor"]
[null,null,"2.","Capturista",null,null,null,null,null,null,null,"7.","Oficial registradora o registrador",null,null,null,null,null,null,null,"12.","Supervisora o supervisor administrativo registral"]
[null,null,"3.","Certificadora o certificador",null,null,null,null,null,null,null,"8.","Regidora o regidor de libros",null,null,null,null,null,null,null,"13.","Validadora o validador"]
[null,null,"4.","Consultora o consultor eventual por honorarios",null,null,null,null,null,null,null,"9.","Registradora o registrador",null,null,null,null,null,null,null,"14.","Otra"]
[null,null,"5.","Inscribidora o inscribidor",null,null,null,null,null,null,null,"10.","Registradora o registrador suplente y/ o auxiliar",null,null,null,null,null,null,null,"99.","No se sabe"]
[]
[null,null,"En caso de tener algún comentario u observación al dato registrado en la respuesta de la presente pregunta, o de los datos que derivan de la misma, favor de anotarlo en el siguiente espacio. De lo contrario, déjelo en blanco."]
[]
[]
[]
[]
[]
[null,null,null,null,null,null,null,null,null,null,null,null,null,null,null,null,null,null,null,null,null,null,null,null,null,null,null,null,null,null,null,null,null,"AUX"]
[null,null,null,null,null,null,null,null,null,null,null,null,null,null,null,null,null,null,null,null,null,null,null,null,null,null,null,null,null,null,null,null,"X",{"$f":"IF(OR(C91=\"\",E93=\"\",E95=\"\"),\"X\",\"\")","v":"X"}]
["2.11.-","Anote la cantidad total de personal adscrito a la institución registral de la entidad federativa al cierre del año 2025.",null,null,null,null,null,null,null,null,null,null,null,null,null,null,null,null,null,null,null,null,null,null,null,null,null,null,null,null,null,null,{"$f":"IF(AG17=\"\",IF(COUNTBLANK(C91)+COUNTBLANK(E93)+COUNTBLANK(E95)>0,1,0),0)","v":0}]
[]
[null,null,null,null,null,null,"1. Total de personal (suma de 1.1 Hombres + 1.2 Mujeres)"]
[]
[null,null,null,null,null,null,null,null,"1.1 Hombres"]
[]
[null,null,null,null,null,null,null,null,"1.2 Mujeres"]
[]
[null,null,"En caso de tener algún comentario u observación al dato registrado en la respuesta de la presente pregunta, o de los datos que derivan de la misma, favor de anotarlo en el siguiente espacio. De lo contrario, déjelo en blanco."]
[]
[]
[]
[]
[]
[]
[]
["2.12.-","Anote, conforme a la siguiente tabla, la cantidad de personal según régimen de contratación y sexo al cierre del año 2025.",null,null,null,null,null,null,null,null,null,null,null,null,null,null,null,null,null,null,null,null,null,null,null,null,null,null,null,null,null,null,{"$f":"IF(AND(UPPER(E93)=\"NS\",UPPER(E95)=\"NS\"),0,IF(AND(C91<>\"\", E93<>\"\", E95<>\"\"),IF(AND(COUNTBLANK(P111:P118) = 0,COUNTBLANK(U111:U118) = 0,COUNTBLANK(Z111:Z118) = 0),0,1),0))","v":0}]
[null,null,"Las sumas de las cantidades anotadas por régimen de contratación y por sexo deben ser iguales al total de personal registrado como respuesta de la pregunta 2.11."]
[null,null,"Si usa el numeral 8, anote el otro régimen de contratación en el recuadro que se encuentra al final de la tabla."]
[]
[null,null,"Régimen de contratación",null,null,null,null,null,null,null,null,null,null,null,null,"Total",null,null,null,null,"Personal adscrito a la institución registral, según sexo"]
[null,null,null,null,null,null,null,null,null,null,null,null,null,null,null,null,null,null,null,null,"Hombres",null,null,null,null,"Mujeres"]
[null,null,"1.","Confianza"]
[null,null,"2.","Base o sindicalizado"]
[null,null,"3.","Eventual"]
[null,null,"4.","Honorarios"]
[null,null,"5.","Personal comisionado"]
[null,null,"6.","Estabilidad laboral (Nómina 8)"]
[null,null,"7.","Interinato"]
[null,null,"8.","Otro (especifique)"]
[null,null,null,null,null,null,null,null,null,null,null,null,null,null,"S",{"$f":"IF(COUNTBLANK(P111:P118)=8,\"\",IF(AND(SUM(P111:T118)=0,COUNTIF(P111:T118,\"NS\")>0),\"NS\",SUM(P111:T118)))","v":""},null,null,null,null,{"$f":"IF(COUNTBLANK(U111:U118)=8,\"\",IF(AND(SUM(U111:Y118)=0,COUNTIF(U111:Y118,\"NS\")>0),\"NS\",SUM(U111:Y118)))","v":""},null,null,null,null,{"$f":"IF(COUNTBLANK(Z111:Z118)=8,\"\",IF(AND(SUM(Z111:AD118)=0,COUNTIF(Z111:AD118,\"NS\")>0),\"NS\",SUM(Z111:AD118)))","v":""}]
[]
[null,null,"Otro régimen de contratación:\n(especifique)",null,null,null,null,null,null,null,null,null,null,null,null,null,null,null,null,null,null,null,null,null,null,null,null,null,null,null,null,null,{"$f":"IF(AND(UPPER(E93)=\"NS\",UPPER(E95)=\"NS\"),0,IF(AND(P118>0,UPPER(P118)<>\"NS\"),COUNTBLANK(G121),0))","v":0}]
[]
[null,null,"En caso de tener algún comentario u observación al dato registrado en la respuesta de la presente pregunta, o de los datos que derivan de la misma, favor de anotarlo en el siguiente espacio. De lo contrario, déjelo en blanco."]
[]
[]
[]
[]
[]
[]
[]
["2.13.-","Anote, conforme a la siguiente tabla, la cantidad de personal según nivel de escolaridad y sexo al cierre del año 2025.",null,null,null,null,null,null,null,null,null,null,null,null,null,null,null,null,null,null,null,null,null,null,null,null,null,null,null,null,null,null,{"$f":"IF(AND(UPPER(E93)=\"NS\",UPPER(E95)=\"NS\"),0,IF(AND(C91<>\"\", E93<>\"\", E95<>\"\"),IF(AND(COUNTBLANK(P136:P143) = 0,COUNTBLANK(U136:U143) = 0,COUNTBLANK(Z136:Z143) = 0),0,1),0))","v":0}]
[null,null,"Las sumas de las cantidades anotadas por nivel de escolaridad y por sexo deben ser iguales al total de personal registrado como respuesta de la pregunta 2.11."]
[]
[null,null,"Nivel de escolaridad",null,null,null,null,null,null,null,null,null,null,null,null,"Total",null,null,null,null,"Personal adscrito a la institución registral, según sexo"]
[null,null,null,null,null,null,null,null,null,null,null,null,null,null,null,null,null,null,null,null,"Hombres",null,null,null,null,"Mujeres"]
[null,null,"1.","Ninguno"]
[null,null,"2.","Preescolar o primaria"]
[null,null,"3.","Secundaria"]
[null,null,"4.","Preparatoria"]
[null,null,"5.","Carrera técnica o comercial"]
[null,null,"6.","Licenciatura"]
[null,null,"7.","Maestría"]
[null,null,"8.","Doctorado"]
[null,null,null,null,null,null,null,null,null,null,null,null,null,null,"S",{"$f":"IF(COUNTBLANK(P136:P143)=8,\"\",IF(AND(SUM(P136:T143)=0,COUNTIF(P136:T143,\"NS\")>0),\"NS\",SUM(P136:T143)))","v":""},null,null,null,null,{"$f":"IF(COUNTBLANK(U136:U143)=8,\"\",IF(AND(SUM(U136:Y143)=0,COUNTIF(U136:Y143,\"NS\")>0),\"NS\",SUM(U136:Y143)))","v":""},null,null,null,null,{"$f":"IF(COUNTBLANK(Z136:Z143)=8,\"\",IF(AND(SUM(Z136:AD143)=0,COUNTIF(Z136:AD143,\"NS\")>0),\"NS\",SUM(Z136:AD143)))","v":""}]
[]
[null,null,"En caso de tener algún comentario u observación al dato registrado en la respuesta de la presente pregunta, o de los datos que derivan de la misma, favor de anotarlo en el siguiente espacio. De lo contrario, déjelo en blanco."]
[]
[]
[]
[]
[]
[]
[]
["2.14.-","Anote, conforme a la siguiente tabla, la cantidad de personal según rango de edad y sexo al cierre del año 2025.",null,null,null,null,null,null,null,null,null,null,null,null,null,null,null,null,null,null,null,null,null,null,null,null,null,null,null,null,null,null,{"$f":"IF(AND(UPPER(E93)=\"NS\",UPPER(E95)=\"NS\"),0,IF(AND(C91<>\"\", E93<>\"\", E95<>\"\"),IF(AND(COUNTBLANK(P159:P167) = 0,COUNTBLANK(U159:U167) = 0,COUNTBLANK(Z159:Z167) = 0),0,1),0))","v":0}]
[null,null,"Las sumas de las cantidades anotadas por rango de edad y por sexo deben ser iguales al total de personal registrado como respuesta de la pregunta 2.11."]
[]
[null,null,"Rango de edad",null,null,null,null,null,null,null,null,null,null,null,null,"Total",null,null,null,null,"Personal adscrito a la institución registral, según sexo"]
[null,null,null,null,null,null,null,null,null,null,null,null,null,null,null,null,null,null,null,null,"Hombres",null,null,null,null,"Mujeres"]
[null,null,"1.","18 a 24 años"]
[null,null,"2.","25 a 29 años"]
[null,null,"3.","30 a 34 años"]
[null,null,"4.","35 a 39 años"]
[null,null,"5.","40 a 44 años"]
[null,null,"6.","45 a 49 años"]
[null,null,"7.","50 a 54 años"]
[null,null,"8.","55 a 59 años"]
[null,null,"9.","60 años o más"]
[null,null,null,null,null,null,null,null,null,null,null,null,null,null,"S",{"$f":"IF(COUNTBLANK(P159:P167)=9,\"\",IF(AND(SUM(P159:T167)=0,COUNTIF(P159:T167,\"NS\")>0),\"NS\",SUM(P159:T167)))","v":""},null,null,null,null,{"$f":"IF(COUNTBLANK(U159:U167)=9,\"\",IF(AND(SUM(U159:Y167)=0,COUNTIF(U159:Y167,\"NS\")>0),\"NS\",SUM(U159:Y167)))","v":""},null,null,null,null,{"$f":"IF(COUNTBLANK(Z159:Z167)=9,\"\",IF(AND(SUM(Z159:AD167)=0,COUNTIF(Z159:AD167,\"NS\")>0),\"NS\",SUM(Z159:AD167)))","v":""}]
[]
[null,null,"En caso de tener algún comentario u observación al dato registrado en la respuesta de la presente pregunta, o de los datos que derivan de la misma, favor de anotarlo en el siguiente espacio. De lo contrario, déjelo en blanco."]
[]
[]
[]
[]
[]
[]
[]
["2.15.-","Indique si en la institución registral de la entidad federativa existieron las siguientes áreas y anote el personal adscrito en cada una al cierre del año 2025.",null,null,null,null,null,null,null,null,null,null,null,null,null,null,null,null,null,null,null,null,null,null,null,null,null,null,null,null,null,null,{"$f":"IF(AND(UPPER(E93)=\"NS\",UPPER(E95)=\"NS\"),0,IF(AND(C91<>\"\", E93<>\"\", E95<>\"\"),IF(AND(N186=1,OR(S186=\"\",W186=\"\",AA186=\"\")),1,0)+IF(AND(N187=1,OR(S187=\"\",W187=\"\",AA187=\"\")),1,0)+IF(AND(N188=1,OR(S188=\"\",W188=\"\",AA188=\"\")),1,0)+IF(AND(N189=1,OR(S189=\"\",W189=\"\",AA189=\"\")),1,0)+IF(AND(N190=1,OR(S190=\"\",W190=\"\",AA190=\"\")),1,0)+IF(AND(N191=1,OR(S191=\"\",W191=\"\",AA191=\"\")),1,0)+IF(AND(N192=1,OR(S192=\"\",W192=\"\",AA192=\"\")),1,0)+IF(AND(N193=1,OR(S193=\"\",W193=\"\",AA193=\"\")),1,0)+IF(AND(N194=1,OR(S194=\"\",W194=\"\",AA194=\"\")),1,0)+IF(AND(N195=1,OR(S195=\"\",W195=\"\",AA195=\"\")),1,0)+IF(AND(N196=1,OR(S196=\"\",W196=\"\",AA196=\"\")),1,0)+IF(AND(N197=1,OR(S197=\"\",W197=\"\",AA197=\"\")),1,0)+IF(AND(N198=1,OR(S198=\"\",W198=\"\",AA198=\"\")),1,0)+IF(AND(N199=1,OR(S199=\"\",W199=\"\",AA199=\"\")),1,0)+IF(AND(N200=1,OR(S200=\"\",W200=\"\",AA200=\"\")),1,0)+IF(AND(N201=1,OR(S201=\"\",W201=\"\",AA201=\"\")),1,0)+IF(AND(N202=1,OR(S202=\"\",W202=\"\",AA202=\"\")),1,0)+IF(AND(N203=1,OR(S203=\"\",W203=\"\",AA203=\"\")),1,0)+IF(AND(N204=1,OR(S204=\"\",W204=\"\",AA204=\"\")),1,0)+IF(AND(N205=1,OR(S205=\"\",W205=\"\",AA205=\"\")),1,0)+COUNTBLANK(N186)+COUNTBLANK(N187)+COUNTBLANK(N188)+COUNTBLANK(N189)\n+COUNTBLANK(N190)+COUNTBLANK(N191)+COUNTBLANK(N192)+COUNTBLANK(N193)+COUNTBLANK(N194)+COUNTBLANK(N195)+COUNTBLANK(N196)+COUNTBLANK(N197)+COUNTBLANK(N198)+COUNTBLANK(N199)\n+COUNTBLANK(N200)+COUNTBLANK(N201)+COUNTBLANK(N202)+COUNTBLANK(N203)+COUNTBLANK(N204)+COUNTBLANK(N205),0))","v":0}]
[null,null,"Las sumas de las cantidades anotadas por área y por sexo deben ser iguales al total de personal registrado como respuesta de la pregunta 2.11."]
[null,null,"Si existió personal que atendió, colaboró o estuvo asignado a más de un área, contabilícelo solo en la que desarrolló mayor actividad."]
[null,null,"El numeral \"11. Cajas\" debe de responderse con \"1. Sí \" cuando dicha área pertenezca a la institución registral. Si pertenece a Secretaría de Finanzas u otra institución, responda \"2. No\"."]
[null,null,"Si responde \"1. Sí \" en el numeral 14, anote la otra área en el recuadro que se encuentra al final de la tabla."]
[]
[null,null,"Área",null,null,null,null,null,null,null,null,null,null,"¿Existió el área?\n(1.Sí / 2.No / 9.No se sabe)",null,null,null,null,"Total ",null,null,null,"Personal adscrito a la institución registral, según sexo"]
[null,null,null,null,null,null,null,null,null,null,null,null,null,null,null,null,null,null,null,null,null,null,"Hombres",null,null,null,"Mujeres"]
[null,null,"1.",null,"Dirección"]
[null,null,"2.",null,"Jurídico"]
[null,null,"3.",null,"Informática "]
[null,null,"4.",null,"Administrativo"]
[null,null,"5. Atención al público/información",null,"5.1","Ventanilla de trámites al público en general"]
[null,null,null,null,"5.2","Ventanilla de trámites para gestores y notarías"]
[null,null,null,null,"5.3","Ventanilla de trámites para atención especial",null,null,null,null,null,null,null,null,null,null,null,null,null,null,null,null,null,null,null,null,null,null,null,null,null,null,1]
[null,null,null,null,"5.4","Área de entrega de documentos"]
[null,null,"6.",null,"Consulta de información registral"]
[null,null,"7. Conservación del acervo ",null,"7.1","Archivo"]
[null,null,null,null,"7.2","Digitalización"]
[null,null,"8. Procesos registrales",null,"8.1","Registro/inscripción"]
[null,null,null,null,"8.2","Calificación/validación"]
[null,null,null,null,"8.3","Certificación"]
[null,null,"9.","9.","Mercantil"]
[null,null,"10.","10.","Fiscalización"]
[null,null,"11.","11.","Cajas"]
[null,null,"12.","12.","Auxiliar"]
[null,null,"13.","13.","Modernización"]
[null,null,"14.","14.","Otra (especifique)"]
[null,null,null,null,null,null,null,null,null,null,null,null,null,null,null,null,null,"S",{"$f":"IF(COUNTBLANK(S186:S205)=20,\"\",IF(AND(SUM(S186:V205)=0,COUNTIF(S186:V205,\"NS\")>0),\"NS\",SUM(S186:V205)))","v":""},null,null,null,{"$f":"IF(COUNTBLANK(W186:W205)=20,\"\",IF(AND(SUM(W186:Z205)=0,COUNTIF(W186:Z205,\"NS\")>0),\"NS\",SUM(W186:Z205)))","v":""},null,null,null,{"$f":"IF(COUNTBLANK(AA186:AA205)=20,\"\",IF(AND(SUM(AA186:AD205)=0,COUNTIF(AA186:AD205,\"NS\")>0),\"NS\",SUM(AA186:AD205)))","v":""}]
[]
[null,null,"Otra área:\n(especifique)",null,null,null,null,null,null,null,null,null,null,null,null,null,null,null,null,null,null,null,null,null,null,null,null,null,null,null,null,null,{"$f":"IF(N205=1,COUNTBLANK(G208),0)","v":0}]
[]
[null,null,"En caso de tener algún comentario u observación al dato registrado en la respuesta de la presente pregunta, o de los datos que derivan de la misma, favor de anotarlo en el siguiente espacio. De lo contrario, déjelo en blanco."]
[]
[]
[]
[]
[]
[]
[]
["2.16.-","Indique si el personal de la institución registral de la entidad federativa fue capacitado en temas registrales durante el año 2025.",null,null,null,null,null,null,null,null,null,null,null,null,null,null,null,null,null,null,null,null,null,null,null,null,null,null,null,null,null,null,{"$f":"IF(AG17=\"\",IF(COUNTBLANK(C221)+COUNTBLANK(I221)+COUNTBLANK(T221)=3,1,0),0)","v":0}]
[null,null,"Seleccione con \"X\" un solo código."]
[]
[null,null,null,"1. Sí",null,null,null,null,null,"2. No (pase a la pregunta 2.19)",null,null,null,null,null,null,null,null,null,null,"9. No se sabe (pase a la pregunta 2.19)"]
[]
[null,null,"En caso de tener algún comentario u observación al dato registrado en la respuesta de la presente pregunta, o de los datos que derivan de la misma, favor de anotarlo en el siguiente espacio. De lo contrario, déjelo en blanco."]
[]
[]
[]
[]
[]
[]
[]
["2.17.-","Indique si la formación brindada durante el año 2025 fue parte de un programa anual de capacitación de la institución registral de la entidad federativa.",null,null,null,null,null,null,null,null,null,null,null,null,null,null,null,null,null,null,null,null,null,null,null,null,null,null,null,null,null,null,{"$f":"IF(UPPER(C221)=\"X\",IF(COUNTBLANK(C234)+COUNTBLANK(I234)+COUNTBLANK(T234)=3,1,0),0)","v":0}]
[null,null,"Seleccione con \"X\" un solo código."]
[]
[null,null,null,"1. Sí",null,null,null,null,null,"2. No",null,null,null,null,null,null,null,null,null,null,"9. No se sabe"]
[]
[null,null,"En caso de tener algún comentario u observación al dato registrado en la respuesta de la presente pregunta, o de los datos que derivan de la misma, favor de anotarlo en el siguiente espacio. De lo contrario, déjelo en blanco."]
[]
[]
[]
[]
[]
[]
[]
["2.18.-","Indique si se recibió capacitación en los siguientes temas y anote tanto la cantidad de cursos como la cantidad de personal capacitado durante el año 2025.",null,null,null,null,null,null,null,null,null,null,null,null,null,null,null,null,null,null,null,null,null,null,null,null,null,null,null,null,null,null,{"$f":"IF(UPPER(C221)=\"X\",(IF(AND(P249=1,OR(U249=\"\",Z249=\"\")),1,0)+IF(AND(P250=1,OR(U250=\"\",Z250=\"\")),1,0)+IF(AND(P251=1,OR(U251=\"\",Z251=\"\")),1,0)+IF(AND(P252=1,OR(U252=\"\",Z252=\"\")),1,0)+IF(AND(P253=1,OR(U253=\"\",Z253=\"\")),1,0)+IF(AND(P254=1,OR(U254=\"\",Z254=\"\")),1,0)+IF(AND(P255=1,OR(U255=\"\",Z255=\"\")),1,0)+IF(AND(P256=1,OR(U256=\"\",Z256=\"\")),1,0)+IF(AND(P257=1,OR(U257=\"\",Z257=\"\")),1,0)+COUNTBLANK(P249:P257)),0)","v":0}]
[null,null,"Si responde \"1. Sí\" en el numeral 9, anote el otro tema de capacitación en el recuadro que se encuentra al final de la tabla. Añada únicamente otro tema que esté relacionado a la actividad registral."]
[null,null,"La cantidad de personal capacitado por tema deberá ser menor o igual al total de personal registrado en la pregunta 2.11."]
[]
[null,null,"Tema",null,null,null,null,null,null,null,null,null,null,null,null,"¿Se recibió capacitación?\n(1.Sí / 2.No / \n9.No se sabe)",null,null,null,null,"Cantidad de cursos",null,null,null,null,"Cantidad de\npersonal capacitado"]
[null,null,"1.","Marco jurídico"]
[null,null,"2.","Procesos registrales"]
[null,null,"3.","Trámites registrales"]
[null,null,"4.","Atención al público"]
[null,null,"5.","Tecnologías de la información"]
[null,null,"6.","Gestión de calidad"]
[null,null,"7.","Participación y vinculación con otros sectores"]
[null,null,"8.","Transparencia"]
[null,null,"9.","Otro (especifique)"]
[]
[null,null,"Otro tema de capacitación:\n(especifique)",null,null,null,null,null,null,null,null,null,null,null,null,null,null,null,null,null,null,null,null,null,null,null,null,null,null,null,null,null,{"$f":"IF(P257=1,COUNTBLANK(G259),0)","v":0}]
[]
[null,null,"En caso de tener algún comentario u observación al dato registrado en la respuesta de la presente pregunta, o de los datos que derivan de la misma, favor de anotarlo en el siguiente espacio. De lo contrario, déjelo en blanco."]

{"sheet":"CNGE_2026_M6_Secc2_Sub3","index":6,"n_rows":217,"n_cols":37,"rows_kept":217,"cut":false,"hidden":true,"merged":[[217,2,217,29],[212,3,212,17],[212,18,212,23],[212,24,212,29],[214,2,214,5],[214,6,214,29],[216,2,216,29],[210,3,210,17],[210,18,210,23],[210,24,210,29],[211,3,211,17],[211,18,211,23],[211,24,211,29],[206,2,206,29],[208,2,208,17],[208,18,208,23],[208,24,208,29],[209,3,209,17],[209,18,209,23],[209,24,209,29],[193,3,193,29],[195,2,195,5],[195,6,195,29],[197,2,197,29],[198,2,198,29],[205,1,205,29],[187,3,187,29],[188,3,188,29],[189,3,189,29],[190,3,190,29],[191,3,191,29],[192,3,192,29],[181,3,181,29],[182,3,182,29],[183,3,183,29],[184,3,184,29],[185,3,185,29],[186,3,186,29],[168,2,168,29],[169,2,169,29],[176,1,176,29],[177,2,177,29],[178,2,178,29],[179,2,179,29],[160,2,160,29],[162,3,162,29],[163,3,163,29],[164,3,164,29],[166,2,166,5],[166,6,166,29],[148,2,148,5],[148,6,148,29],[150,2,150,29],[151,2,151,29],[158,1,158,29],[159,2,159,29],[141,3,141,29],[142,3,142,29],[143,3,143,29],[144,3,144,29],[145,3,145,29],[146,3,146,29],[135,3,135,29],[136,3,136,29],[137,3,137,29],[138,3,138,29],[139,3,139,29],[140,3,140,29],[129,3,129,29],[130,3,130,29],[131,3,131,29],[132,3,132,29],[133,3,133,29],[134,3,134,29],[123,3,123,29],[124,3,124,29],[125,3,125,29],[126,3,126,29],[127,3,127,29],[128,3,128,29],[110,2,110,29],[111,2,111,29],[118,1,118,29],[119,2,119,29],[120,2,120,29],[121,2,121,29],[105,3,105,24],[105,25,105,29],[106,3,106,24],[106,25,106,29],[108,2,108,5],[108,6,108,29],[102,3,102,24],[102,25,102,29],[103,3,103,24],[103,25,103,29],[104,3,104,24],[104,25,104,29],[99,3,99,24],[99,25,99,29],[100,3,100,24],[100,25,100,29],[101,3,101,24],[101,25,101,29],[96,3,96,24],[96,25,96,29],[97,3,97,24],[97,25,97,29],[98,3,98,24],[98,25,98,29],[93,3,93,24],[93,25,93,29],[94,3,94,24],[94,25,94,29],[95,3,95,24],[95,25,95,29],[88,1,88,29],[89,2,89,29],[91,2,91,24],[91,25,91,29],[92,3,92,24],[92,25,92,29],[75,3,75,29],[76,3,76,29],[78,2,78,5],[78,6,78,29],[80,2,80,29],[81,2,81,29],[68,3,68,29],[69,3,69,29],[70,3,70,29],[71,3,71,29],[72,3,72,29],[74,3,74,29],[73,3,73,29],[62,3,62,29],[63,3,63,29],[64,3,64,29],[65,3,65,29],[66,3,66,29],[67,3,67,29],[49,2,49,29],[50,2,50,29],[57,1,57,29],[58,2,58,29],[59,2,59,29],[60,2,60,29],[42,3,42,29],[43,3,43,29],[44,3,44,29],[45,3,45,29],[47,2,47,5],[47,6,47,29],[36,3,36,29],[37,3,37,29],[38,3,38,29],[39,3,39,29],[40,3,40,29],[41,3,41,29],[30,3,30,29],[31,3,31,29],[32,3,32,29],[33,3,33,29],[34,3,34,29],[35,3,35,29],[22,2,22,29],[23,2,23,29],[24,2,24,29],[26,3,26,29],[27,3,27,29],[28,3,28,29],[29,3,29,29],[18,2,18,29],[19,2,19,29],[21,1,21,29],[9,1,9,29],[10,1,10,29],[11,2,11,29],[12,2,12,29],[13,2,13,29],[14,2,14,29],[0,1,0,29],[2,1,2,29],[4,1,4,29],[6,26,6,29],[7,1,7,11],[7,13,7,14],[15,2,15,29],[16,2,16,29],[17,2,17,29]]}
[null,"CENSO NACIONAL DE GOBIERNOS\nESTATALES 2026",null,null,null,null,null,null,null,null,null,null,null,null,null,null,null,null,null,null,null,null,null,null,null,null,null,null,null,null,null,null,{"$f":"IF(SUM(AG9)>0,1,0)","v":0}]
[]
[null,"Módulo 6.\nCatastro, registro y territorio"]
[]
[null,"Sección II. Registro Público de la Propiedad"]
[]
[null,"Entidad:",null,null,null,null,null,null,null,null,null,null,null,"Clave:",null,null,null,null,null,null,null,null,null,null,null,null,"Índice"]
[null,{"$f":"IF(Índice!B9=\"\",\"\",Índice!B9)","v":""},null,null,null,null,null,null,null,null,null,null,null,{"$f":"IF(Índice!N9=\"\",\"\",Índice!N9)","v":""}]
[null,null,null,null,null,null,null,null,null,null,null,null,null,null,null,null,null,null,null,null,null,null,null,null,null,null,null,null,null,null,null,null,{"$f":"IF(SUM(AG22,AG48,AG58,AG79,AG89,AG109,AG119,AG124,AG149,AG159,AG167,AG177,AG196,AG206,AG215)=0,0,1)","v":0}]
[null,"II.3 Marco jurídico",null,null,null,null,null,null,null,null,null,null,null,null,null,null,null,null,null,null,null,null,null,null,null,null,null,null,null,null,null,null,{"$f":"IF(Índice!B9<>\"\",\"X\",\"\")","v":""}]
[null,"Instrucciones generales para las preguntas de la subsección:"]
[null,null,"1.- Periodo de referencia de los datos: \nAl cierre del año: la información se refiere a lo existente al 31 de diciembre de 2025.\nDurante el año: la información se refiere a lo existente del 1 de enero al 31 de diciembre de 2025."]
[null,null,"2.- Los catálogos utilizados en el presente cuestionario corresponden a denominaciones estándar, de tal forma que si el nombre de alguna clasificación no coincide exactamente con la utilizada en su entidad federativa, debe registrar los datos en aquella que sea homóloga. "]
[null,null,"3.- En caso de que los registros con los que cuente no le permitan desglosar la información de acuerdo con los requerimientos solicitados, anote \"NS\" (No se sabe) en las celdas donde no disponga de información. En el recuadro para comentarios de cada pregunta debe proporcionar una justificación respecto del uso del \"NS\" en determinado reactivo."]
[null,null,"4.- Las cifras deben anotarse con números enteros y sin espacio de separación ni comas, independientemente de si son miles o millones. En el caso de los porcentajes, estos además deben de ir sin el símbolo %."]
[null,null,"5.- No deje celdas en blanco, salvo en los casos en que la instrucción así lo solicite. ",null,null,null,null,null,null,null,null,null,null,null,null,null,null,null,null,null,null,null,null,null,null,null,null,null,null,null,null,null,"Aux2"]
[null,null,"6.- En el caso de las tablas, deben estar contestadas todas las celdas, ya sea anotando \"0\" (cero), en caso de datos numéricos, o eligiendo algún código según el formato de respuesta.",null,null,null,null,null,null,null,null,null,null,null,null,null,null,null,null,null,null,null,null,null,null,null,null,null,null,null,null,null,{"$f":"IF(Índice!B9=\"\",\"X\",\"\")","v":"X"}]
[null,null,"7.- En las preguntas con listas desplegables, seleccione la opción que corresponda a la realidad de la entidad federativa."]
[null,null,"8.- Antes de concluir el cuestionario, revise que no haya celdas rellenas con color rojo, pues dicho color indica que hay error en la información y debe de corregirse. También asegúrese de que no haya celdas con color amarillo, ya que eso significa que falta una respuesta y debe proporcionarse la información.\t"]
[null,null,"9.- ¡Importante!: recuerde que todos los datos proporcionados en el cuestionario deben corresponder a los asentados en sus registros administrativos."]
[]
["2.19.-","Seleccione los ordenamientos jurídicos federales y estatales que durante el año 2025 regularon la actividad registral en la entidad federativa.",null,null,null,null,null,null,null,null,null,null,null,null,null,null,null,null,null,null,null,null,null,null,null,null,null,null,null,null,null,null,{"$f":"IF(AG17=\"\",IF(COUNTBLANK(C27:C46)=20,1,0),0)","v":0}]
[null,null,"Puede seleccionar con \"X\" más de un código."]
[null,null,"Si marca el numeral 18, anote el otro ordenamiento jurídico en el recuadro que se encuentra al final de la lista."]
[null,null,"Si elige el numeral 19 o el 99, no marque otro código."]
[]
[null,null,null,"1. Ley de amparo"]
[null,null,null,"2. Ley agraria"]
[null,null,null,"3. Ley general de sociedades cooperativas"]
[null,null,null,"4. Ley general de sociedades mercantiles"]
[null,null,null,"5. Ley general de títulos y operaciones de crédito"]
[null,null,null,"6. Código de comercio"]
[null,null,null,"7. Reglamento de registro público de comercio"]
[null,null,null,"8. Ley estatal de procedimiento administrativo"]
[null,null,null,"9. Ley estatal de ingresos"]
[null,null,null,"10. Ley estatal de hacienda"]
[null,null,null,"11. Ley de hacienda municipal"]
[null,null,null,"12. Ley estatal de la institución registral u homóloga"]
[null,null,null,"13. Reglamento de la ley estatal de la institución registral u homólogo"]
[null,null,null,"14. Reglamento interior de la institución registral u homólogo"]
[null,null,null,"15. Código civil estatal"]
[null,null,null,"16. Código fiscal estatal"]
[null,null,null,"17. Acuerdos o criterios registrales de observancia obligatoria"]
[null,null,null,"18. Otro (especifique)"]
[null,null,null,"19. Ninguno"]
[null,null,null,"99. No se sabe"]
[]
[null,null,"Otro ordenamiento jurídico:\n(especifique)",null,null,null,null,null,null,null,null,null,null,null,null,null,null,null,null,null,null,null,null,null,null,null,null,null,null,null,null,null,{"$f":"IF(UPPER(C44=\"X\"),COUNTBLANK(G48),0)","v":0}]
[]
[null,null,"En caso de tener algún comentario u observación al dato registrado en la respuesta de la presente pregunta, o de los datos que derivan de la misma, favor de anotarlo en el siguiente espacio. De lo contrario, déjelo en blanco."]
[null,null,null,null,null,null,null,null,null,null,null,null,null,null,null,null,null,null,null,null,null,null,null,null,null,null,null,null,null,null,null,null,null,null,null,null,0]
[]
[]
[]
[]
[]
[]
["2.20.-","Seleccione los ordenamientos jurídicos que durante el año 2025 regularon la actividad registral de manera complementaria en la entidad federativa.",null,null,null,null,null,null,null,null,null,null,null,null,null,null,null,null,null,null,null,null,null,null,null,null,null,null,null,null,null,null,{"$f":"IF(AG17=\"\",IF(COUNTBLANK(C63:C77)=15,1,0),0)","v":0}]
[null,null,"Puede seleccionar con \"X\" más de un código."]
[null,null,"Si marca el numeral 13, anote el otro ordenamiento jurídico en el recuadro que se encuentra al final de la lista."]
[null,null,"Si elige el numeral 14 o el 99, no marque otro código."]
[]
[null,null,null,"1. Código de procedimientos civiles estatal"]
[null,null,null,"2. Ley estatal de catastro u homóloga"]
[null,null,null,"3. Ley estatal de derechos"]
[null,null,null,"4. Ley estatal de firma electrónica"]
[null,null,null,"5. Ley estatal de responsabilidades de los servidores públicos u homóloga"]
[null,null,null,"6. Ley estatal de vivienda"]
[null,null,null,"7. Ley estatal del notariado u homóloga"]
[null,null,null,"8. Ley estatal del servicio profesional de carrera registral u homóloga"]
[null,null,null,"9. Ley o código estatal en materia de asentamientos humanos, ordenamiento territorial y desarrollo urbano"]
[null,null,null,"10. Ley o reglamento estatal de propiedad en condominio de inmuebles"]
[null,null,null,"11. Ley orgánica de la administración pública estatal"]
[null,null,null,"12. Reglamento de la ley de catastro"]
[null,null,null,"13. Otro (especifique)"]
[null,null,null,"14. Ninguno"]
[null,null,null,"99. No se sabe"]
[]
[null,null,"Otro ordenamiento jurídico:\n(especifique)",null,null,null,null,null,null,null,null,null,null,null,null,null,null,null,null,null,null,null,null,null,null,null,null,null,null,null,null,null,{"$f":"IF(UPPER(C75=\"X\"),COUNTBLANK(G79),0)","v":0}]
[]
[null,null,"En caso de tener algún comentario u observación al dato registrado en la respuesta de la presente pregunta, o de los datos que derivan de la misma, favor de anotarlo en el siguiente espacio. De lo contrario, déjelo en blanco."]
[]
[]
[]
[]
[]
[]
[]
["2.21.-","Indique si las siguientes funciones se establecieron expresamente en los ordenamientos jurídicos que regularon la actividad registral durante el año 2025 en la entidad federativa.",null,null,null,null,null,null,null,null,null,null,null,null,null,null,null,null,null,null,null,null,null,null,null,null,null,null,null,null,null,null,{"$f":"IF(AG17=\"\",IF(COUNTBLANK(Z93:Z107)>0,1,0),0)","v":0}]
[null,null,"Si responde \"1. Sí\" en el numeral 15, anote la otra función en el recuadro que se encuentra al final de la tabla."]
[]
[null,null,"Funciones",null,null,null,null,null,null,null,null,null,null,null,null,null,null,null,null,null,null,null,null,null,null,"¿Se estableció en el ordenamiento jurídico?\n(1.Sí / 2.No / 9.No se sabe)"]
[null,null,"1.","Ejercer la fe pública registral."]
[null,null,"2.","Establecer los mecanismos para cumplir con los principios registrales."]
[null,null,"3.","Proporcionar de manera eficaz y eficiente los servicios y trámites registrales que solicite la ciudadanía."]
[null,null,"4.","Establecer los programas necesarios para evaluar la competencia del personal de la institución registral, certificarlo y asegurar que actualice en forma continua sus conocimientos sobre la normatividad general."]
[null,null,"5.","Establecer los indicadores de eficiencia y productividad de los registradores, funcionarios y empleados de la institución registral."]
[null,null,"6.","Establecer como obligatorio el servicio profesional de la carrera registral."]
[null,null,"7.","Diseñar e instrumentar modalidades de servicios registrales electrónicos y/ o en ventanilla, que, garantizando la certeza jurídica y el rigor de las operaciones registrales, respondan a las necesidades específicas de los usuarios institucionales, de los notarios y de los particulares que participan en el mercado inmobiliario."]
[null,null,"8.","Determinar las tarifas aplicables a los servicios registrales conforme a una metodología previamente establecida, utilizando criterios de racionalidad y sustentabilidad financiera de la institución."]
[null,null,"9.","Mantener un sistema confiable y eficiente de registro de los costos de operación de la institución registral, que apoye la determinación de las tarifas de los servicios registrales. "]
[null,null,"10.","Instrumentar modalidades de pago de los servicios, con el propósito de facilitar a los particulares el registro de las operaciones inmobiliarias y, en consecuencia, favorecer la actualización de los derechos constituidos sobre la propiedad inmobiliaria."]
[null,null,"11.","Diseñar e instrumentar las modalidades de facturación de los servicios a los usuarios, que permitan agilizar el proceso registral, salvaguardando en todo caso los intereses de la institución registral."]
[null,null,"12.","Preservar y conservar, bajo su más estricta responsabilidad, el acervo documental y/ o electrónico que contenga los instrumentos, documentos y avisos propios de la actividad registral."]
[null,null,"13.","Establecer convenios de coordinación y/ o de intercambio de información a título gratuito u oneroso, con las instituciones estatales y/ o federales que tengan a su cargo la administración de catastros o registros inmobiliarios especiales, así como información relevante sobre la propiedad inmobiliaria."]
[null,null,"14.","Establecer convenios de servicios electrónicos y/ o en ventanilla, con los usuarios institucionales, los notarios y/ o los particulares que participan en el mercado inmobiliario."]
[null,null,"15.","Otra (especifique)"]
[]
[null,null,"Otra función:\n(especifique)",null,null,null,null,null,null,null,null,null,null,null,null,null,null,null,null,null,null,null,null,null,null,null,null,null,null,null,null,null,{"$f":"IF(Z107=1,COUNTBLANK(G109),0)","v":0}]
[]
[null,null,"En caso de tener algún comentario u observación al dato registrado en la respuesta de la presente pregunta, o de los datos que derivan de la misma, favor de anotarlo en el siguiente espacio. De lo contrario, déjelo en blanco."]
[]
[]
[]
[]
[]
[]
[]
["2.22.-","Seleccione los principios registrales que se establecieron expresamente en los ordenamientos jurídicos que regularon la actividad registral durante el año 2025 en la entidad federativa.",null,null,null,null,null,null,null,null,null,null,null,null,null,null,null,null,null,null,null,null,null,null,null,null,null,null,null,null,null,null,{"$f":"IF(AG17=\"\",IF(COUNTBLANK(C124:C147)=24,1,0),0)","v":0}]
[null,null,"Puede seleccionar con \"X\" más de un código."]
[null,null,"Si marca el numeral 22, anote el otro principio registral en el recuadro que se encuentra al final de la lista."]
[null,null,"Si elige el numeral 23 o el 99, no marque otro código."]
[]
[null,null,null,"1. Fe pública registral"]
[null,null,null,"2. Publicidad"]
[null,null,null,"3. Inscripción"]
[null,null,null,"4. Especialidad o determinación"]
[null,null,null,"5. Consentimiento"]
[null,null,null,"6. Tracto sucesivo"]
[null,null,null,"7. Rogación"]
[null,null,null,"8. Prioridad o prelación"]
[null,null,null,"9. Legalidad y calificación registral"]
[null,null,null,"10. Legitimación"]
[null,null,null,"11. Oponibilidad"]
[null,null,null,"12. Veracidad"]
[null,null,null,"13. Identidad"]
[null,null,null,"14. Ubicación geográfica"]
[null,null,null,"15. Desarrollo multifinalitario"]
[null,null,null,"16. Socialización"]
[null,null,null,"17. Tercero registral"]
[null,null,null,"18. Propiedad"]
[null,null,null,"19. Equivalencia funcional"]
[null,null,null,"20. Apariencia jurídica"]
[null,null,null,"21. Obligatoriedad"]
[null,null,null,"22. Otro (especifique)"]
[null,null,null,"23. Ninguno"]
[null,null,null,"99. No se sabe"]
[]
[null,null,"Otro principio registral:\n(especifique)",null,null,null,null,null,null,null,null,null,null,null,null,null,null,null,null,null,null,null,null,null,null,null,null,null,null,null,null,null,{"$f":"IF(UPPER(C145=\"X\"),COUNTBLANK(G149),0)","v":0}]
[]
[null,null,"En caso de tener algún comentario u observación al dato registrado en la respuesta de la presente pregunta, o de los datos que derivan de la misma, favor de anotarlo en el siguiente espacio. De lo contrario, déjelo en blanco."]
[null,null,null,null,null,null,null,null,null,null,null,null,null,null,null,null,null,null,null,null,null,null,null,null,null,null,null,null,null,null,null,null,null,null,null,null,0]
[]
[]
[]
[]
[]
[]
["2.23.-","Seleccione el efecto que tuvo la inscripción de los actos o contratos en la institución registral de la entidad federativa durante el año 2025.",null,null,null,null,null,null,null,null,null,null,null,null,null,null,null,null,null,null,null,null,null,null,null,null,null,null,null,null,null,null,{"$f":"IF(AG17=\"\",IF(COUNTBLANK(C163:C165)=3,1,0),0)","v":0}]
[null,null,"Seleccione con \"X\" un solo código."]
[null,null,"Si marca el numeral 3, anote el otro efecto en el recuadro que se encuentra al final de la lista."]
[]
[null,null,null,"1. Declarativo"]
[null,null,null,"2. Declarativo y constitutivo"]
[null,null,null,"3. Otro (especifique)"]
[]
[null,null,"Otro efecto:\n(especifique)",null,null,null,null,null,null,null,null,null,null,null,null,null,null,null,null,null,null,null,null,null,null,null,null,null,null,null,null,null,{"$f":"IF(UPPER(C165=\"X\"),COUNTBLANK(G167),0)","v":0}]
[]
[null,null,"En caso de tener algún comentario u observación al dato registrado en la respuesta de la presente pregunta, o de los datos que derivan de la misma, favor de anotarlo en el siguiente espacio. De lo contrario, déjelo en blanco."]
[]
[]
[]
[]
[]
[]
[]
["2.24.-","Seleccione los documentos electrónicos que tuvieron validez legal durante el año 2025. ",null,null,null,null,null,null,null,null,null,null,null,null,null,null,null,null,null,null,null,null,null,null,null,null,null,null,null,null,null,null,{"$f":"IF(AG17=\"\",IF(COUNTBLANK(C182:C194)=13,1,0),0)","v":0}]
[null,null,"Puede seleccionar con \"X\" más de un código."]
[null,null,"Si marca el numeral 11, anote el otro documento electrónico en el recuadro que se encuentra al final de la lista."]
[null,null,"Si elige el numeral 12 o el 99, no marque otro código."]
[]
[null,null,null,"1. Folio real electrónico "]
[null,null,null,"2. Imágenes digitales de documentos externos e internos"]
[null,null,null,"3. Firma electrónica"]
[null,null,null,"4. Sellos electrónicos"]
[null,null,null,"5. Formas precodificadas electrónicas"]
[null,null,null,"6. Constancias certificadas"]
[null,null,null,"7. Copias certificadas de inscripciones y anotaciones"]
[null,null,null,"8. Copias certificadas de los documentos externos en poder de la institución registral"]
[null,null,null,"9. Estrados electrónicos que publique la institución registral"]
[null,null,null,"10. Código Quick Response (QR)"]
[null,null,null,"11. Otro (especifique)"]
[null,null,null,"12. Ninguno"]
[null,null,null,"99. No se sabe"]
[]
[null,null,"Otro documento electrónico:\n(especifique)",null,null,null,null,null,null,null,null,null,null,null,null,null,null,null,null,null,null,null,null,null,null,null,null,null,null,null,null,null,{"$f":"IF(UPPER(C192=\"X\"),COUNTBLANK(G196),0)","v":0}]
[]
[null,null,"En caso de tener algún comentario u observación al dato registrado en la respuesta de la presente pregunta, o de los datos que derivan de la misma, favor de anotarlo en el siguiente espacio. De lo contrario, déjelo en blanco."]
[]
[]
[]
[]
[]
[]
[]
["2.25.-","Indique si en la institución registral de la entidad federativa existieron los siguientes manuales durante el año 2025 y si tuvieron validez jurídica.",null,null,null,null,null,null,null,null,null,null,null,null,null,null,null,null,null,null,null,null,null,null,null,null,null,null,null,null,null,null,{"$f":"IF(AG17=\"\",IF(AND(S210=1,Y210=\"\"),1,0)+IF(AND(S211=1,Y211=\"\"),1,0)+IF(AND(S212=1,Y212=\"\"),1,0)+IF(AND(S213=1,Y213=\"\"),1,0)+ COUNTBLANK(S210:S213),0)","v":0}]
[null,null,"Si responde \"1. Sí\" en el numeral 4, anote el otro manual en el recuadro que está al final de la tabla."]
[]
[null,null,"Manual",null,null,null,null,null,null,null,null,null,null,null,null,null,null,null,"¿Existió?\n(1.Sí / 2.No / 9.No se sabe)",null,null,null,null,null,"¿Tuvo validez jurídica?\n(1.Sí / 2.No / 9.No se sabe)"]
[null,null,"1.","Manual de organización"]
[null,null,"2.","Manual de procedimientos"]
[null,null,"3.","Manual de sistema de gestión registral "]
[null,null,"4.","Otro (especifique)"]
[]
[null,null,"Otro manual:\n(especifique)",null,null,null,null,null,null,null,null,null,null,null,null,null,null,null,null,null,null,null,null,null,null,null,null,null,null,null,null,null,{"$f":"IF(S213=1,COUNTBLANK(G215),0)","v":0}]
[]
[null,null,"En caso de tener algún comentario u observación al dato registrado en la respuesta de la presente pregunta, o de los datos que derivan de la misma, favor de anotarlo en el siguiente espacio. De lo contrario, déjelo en blanco."]

{"sheet":"CNGE_2026_M6_Secc2_Sub4","index":7,"n_rows":598,"n_cols":38,"rows_kept":598,"cut":false,"hidden":true,"merged":[[146,25,146,29],[146,3,146,24],[144,3,144,24],[144,25,144,29],[594,3,594,29],[595,3,595,29],[597,2,597,29],[598,2,598,29],[581,2,581,29],[582,2,582,29],[589,1,589,29],[590,2,590,29],[591,2,591,29],[593,3,593,29],[573,3,573,29],[574,3,574,29],[575,3,575,29],[576,3,576,29],[577,3,577,29],[579,2,579,5],[579,6,579,29],[566,1,566,29],[567,2,567,29],[568,2,568,29],[569,2,569,29],[571,3,571,29],[572,3,572,29],[545,2,545,29],[546,2,546,29],[553,1,553,29],[554,2,554,29],[558,2,558,29],[559,2,559,29],[537,3,537,29],[538,3,538,29],[539,3,539,29],[540,3,540,29],[541,3,541,29],[543,2,543,5],[543,6,543,29],[524,2,524,29],[525,2,525,29],[532,1,532,29],[533,2,533,29],[534,2,534,29],[535,2,535,29],[516,3,516,29],[517,3,517,29],[518,3,518,29],[519,3,519,29],[520,3,520,29],[522,2,522,5],[522,6,522,29],[509,1,509,29],[510,2,510,29],[511,2,511,29],[512,2,512,29],[514,3,514,29],[515,3,515,29],[488,2,488,29],[489,2,489,29],[496,1,496,29],[497,2,497,29],[501,2,501,29],[502,2,502,29],[481,3,481,29],[482,3,482,29],[483,3,483,29],[484,3,484,29],[486,2,486,5],[486,6,486,29],[468,2,468,29],[475,1,475,29],[476,2,476,29],[477,2,477,29],[478,2,478,29],[480,3,480,29],[461,3,461,29],[462,3,462,29],[463,3,463,29],[465,2,465,5],[465,6,465,29],[467,2,467,29],[454,1,454,29],[455,2,455,29],[456,2,456,29],[457,2,457,29],[459,3,459,29],[460,3,460,29],[433,2,433,29],[434,2,434,29],[441,1,441,29],[442,2,442,29],[446,2,446,29],[447,2,447,29],[426,3,426,29],[427,3,427,29],[428,3,428,29],[429,3,429,29],[431,2,431,5],[431,6,431,29],[420,3,420,29],[421,3,421,29],[422,3,422,29],[423,3,423,29],[424,3,424,29],[425,3,425,29],[414,3,414,29],[415,3,415,29],[416,3,416,29],[417,3,417,29],[418,3,418,29],[419,3,419,29],[408,3,408,29],[409,3,409,29],[410,3,410,29],[411,3,411,29],[412,3,412,29],[413,3,413,29],[402,3,402,29],[403,3,403,29],[404,3,404,29],[405,3,405,29],[406,3,406,29],[407,3,407,29],[389,2,389,29],[396,1,396,29],[397,2,397,29],[398,2,398,29],[399,2,399,29],[401,3,401,29],[382,3,382,29],[383,3,383,29],[384,3,384,29],[386,2,386,5],[386,6,386,29],[388,2,388,29],[376,3,376,29],[377,3,377,29],[378,3,378,29],[379,3,379,29],[380,3,380,29],[381,3,381,29],[369,2,369,29],[370,2,370,29],[372,3,372,29],[373,3,373,29],[374,3,374,29],[375,3,375,29],[354,1,354,29],[355,2,355,29],[359,2,359,29],[360,2,360,29],[367,1,367,29],[368,2,368,29],[342,3,342,24],[342,25,342,29],[344,2,344,5],[344,6,344,29],[346,2,346,29],[347,2,347,29],[339,3,339,24],[339,25,339,29],[340,3,340,24],[340,25,340,29],[341,3,341,24],[341,25,341,29],[336,2,336,3],[336,4,336,24],[336,25,336,29],[337,3,337,24],[337,25,337,29],[338,3,338,24],[338,25,338,29],[334,2,334,3],[334,4,334,24],[334,25,334,29],[335,2,335,3],[335,4,335,24],[335,25,335,29],[331,3,331,24],[331,25,331,29],[332,2,332,3],[332,4,332,24],[332,25,332,29],[333,2,333,3],[333,4,333,24],[333,25,333,29],[329,2,329,3],[329,4,329,24],[329,25,329,29],[330,2,330,3],[330,4,330,24],[330,25,330,29],[327,2,327,3],[327,4,327,24],[327,25,327,29],[328,2,328,3],[328,4,328,24],[328,25,328,29],[325,2,325,3],[325,4,325,24],[325,25,325,29],[326,2,326,3],[326,4,326,24],[326,25,326,29],[322,2,322,3],[322,4,322,24],[322,25,322,29],[323,3,323,24],[323,25,323,29],[324,2,324,3],[324,4,324,24],[324,25,324,29],[320,2,320,3],[320,4,320,24],[320,25,320,29],[321,2,321,3],[321,4,321,24],[321,25,321,29],[318,2,318,3],[318,4,318,24],[318,25,318,29],[319,2,319,3],[319,4,319,24],[319,25,319,29],[315,3,315,24],[315,25,315,29],[316,2,316,3],[316,4,316,24],[316,25,316,29],[317,2,317,3],[317,4,317,24],[317,25,317,29],[312,3,312,24],[312,25,312,29],[313,2,313,3],[313,4,313,24],[313,25,313,29],[314,2,314,3],[314,4,314,24],[314,25,314,29],[310,2,310,3],[310,4,310,24],[310,25,310,29],[311,2,311,3],[311,4,311,24],[311,25,311,29],[308,2,308,3],[308,4,308,24],[308,25,308,29],[309,2,309,3],[309,4,309,24],[309,25,309,29],[306,2,306,3],[306,4,306,24],[306,25,306,29],[307,2,307,3],[307,4,307,24],[307,25,307,29],[304,2,304,3],[304,4,304,24],[304,25,304,29],[305,2,305,3],[305,4,305,24],[305,25,305,29],[302,2,302,3],[302,4,302,24],[302,25,302,29],[303,2,303,3],[303,4,303,24],[303,25,303,29],[300,2,300,3],[300,4,300,24],[300,25,300,29],[301,2,301,3],[301,4,301,24],[301,25,301,29],[298,2,298,3],[298,4,298,24],[298,25,298,29],[299,2,299,3],[299,4,299,24],[299,25,299,29],[296,2,296,3],[296,4,296,24],[296,25,296,29],[297,2,297,3],[297,4,297,24],[297,25,297,29],[293,2,293,24],[293,25,293,29],[294,3,294,24],[294,25,294,29],[295,3,295,24],[295,25,295,29],[280,2,280,5],[280,6,280,29],[282,2,282,29],[283,2,283,29],[290,1,290,29],[291,2,291,29],[278,2,278,9],[278,10,278,13],[278,14,278,17],[278,18,278,21],[278,22,278,25],[278,26,278,29],[276,2,277,9],[276,10,276,29],[277,10,277,13],[277,14,277,17],[277,18,277,21],[277,22,277,25],[277,26,277,29],[263,2,263,29],[264,2,264,29],[271,1,271,29],[272,2,272,29],[273,2,273,29],[275,2,275,29],[249,2,249,29],[250,2,250,29],[257,1,257,29],[258,2,258,29],[259,2,259,29],[261,2,261,7],[234,2,234,5],[234,6,234,29],[236,2,236,29],[237,2,237,29],[244,1,244,29],[245,2,245,29],[232,2,232,9],[232,10,232,13],[232,14,232,17],[232,18,232,21],[232,22,232,25],[232,26,232,29],[226,2,226,29],[227,2,227,29],[229,2,229,29],[230,2,231,9],[230,10,230,29],[231,10,231,13],[231,14,231,17],[231,18,231,21],[231,22,231,25],[231,26,231,29],[212,2,212,29],[213,2,213,29],[215,2,215,7],[217,2,217,29],[218,2,218,29],[225,1,225,29],[191,2,191,29],[198,1,198,29],[199,2,199,29],[203,2,203,29],[204,2,204,29],[211,1,211,29],[183,1,183,29],[184,2,184,29],[185,2,185,29],[186,2,186,29],[188,2,188,7],[190,2,190,29],[173,3,173,14],[173,15,173,19],[173,20,173,24],[173,25,173,29],[175,2,175,29],[176,2,176,29],[171,3,171,14],[171,15,171,19],[171,20,171,24],[171,25,171,29],[172,3,172,14],[172,15,172,19],[172,20,172,24],[172,25,172,29],[162,2,162,29],[164,1,164,29],[165,2,165,29],[166,2,166,29],[167,2,167,29],[169,2,170,14],[169,15,170,19],[169,20,169,29],[170,20,170,24],[170,25,170,29],[150,2,150,5],[150,6,150,29],[152,2,152,29],[153,2,153,29],[160,1,160,29],[161,1,161,29],[147,3,147,24],[147,25,147,29],[148,3,148,24],[148,25,148,29],[140,3,140,24],[140,25,140,29],[143,3,143,24],[143,25,143,29],[145,3,145,24],[145,25,145,29],[128,2,128,29],[129,2,129,29],[136,1,136,29],[137,2,137,29],[139,2,139,24],[139,25,139,29],[141,3,141,24],[141,25,141,29],[142,3,142,24],[142,25,142,29],[120,3,120,29],[121,3,121,29],[122,3,122,29],[123,3,123,29],[124,3,124,29],[126,2,126,5],[126,6,126,29],[107,2,107,29],[108,2,108,29],[115,1,115,29],[116,2,116,29],[117,2,117,29],[118,2,118,29],[92,2,92,5],[92,6,92,29],[94,2,94,29],[95,2,95,29],[102,1,102,29],[103,2,103,29],[89,3,89,15],[89,16,89,22],[89,23,89,29],[90,3,90,15],[90,16,90,22],[90,23,90,29],[87,3,87,15],[87,16,87,22],[87,23,87,29],[88,3,88,15],[88,16,88,22],[88,23,88,29],[85,3,85,15],[85,16,85,22],[85,23,85,29],[86,3,86,15],[86,16,86,22],[86,23,86,29],[83,2,83,15],[83,16,83,22],[83,23,83,29],[84,3,84,15],[84,16,84,22],[84,23,84,29],[70,2,70,5],[70,6,70,29],[72,2,72,29],[73,2,73,29],[80,1,80,29],[81,2,81,29],[67,3,67,15],[67,16,67,22],[67,23,67,29],[68,3,68,15],[68,16,68,22],[68,23,68,29],[65,4,65,5],[65,6,65,15],[65,16,65,22],[65,23,65,29],[66,4,66,5],[66,6,66,15],[66,16,66,22],[66,23,66,29],[59,2,66,3],[59,4,59,5],[59,6,59,15],[59,16,59,22],[59,23,59,29],[60,4,60,5],[60,6,60,15],[60,16,60,22],[60,23,60,29],[63,4,63,5],[63,6,63,15],[63,16,63,22],[63,23,63,29],[64,4,64,5],[64,6,64,15],[64,16,64,22],[64,23,64,29],[61,6,61,15],[61,16,61,22],[61,23,61,29],[62,4,62,5],[62,6,62,15],[62,16,62,22],[62,23,62,29],[61,4,61,5],[58,3,58,15],[58,16,58,22],[58,23,58,29],[55,4,55,5],[55,6,55,15],[55,16,55,22],[55,23,55,29],[56,4,56,5],[56,6,56,15],[56,16,56,22],[56,23,56,29],[53,6,53,15],[53,16,53,22],[53,23,53,29],[54,4,54,5],[54,6,54,15],[54,16,54,22],[54,23,54,29],[51,2,57,3],[51,4,51,5],[51,6,51,15],[51,16,51,22],[51,23,51,29],[52,4,52,5],[52,6,52,15],[52,16,52,22],[52,23,52,29],[53,4,53,5],[57,4,57,5],[57,6,57,15],[57,16,57,22],[57,23,57,29],[49,16,49,22],[49,23,49,29],[50,4,50,5],[50,6,50,15],[50,16,50,22],[50,23,50,29],[47,3,47,15],[47,16,47,22],[47,23,47,29],[48,2,50,3],[48,4,48,5],[48,6,48,15],[48,16,48,22],[48,23,48,29],[49,4,49,5],[49,6,49,15],[45,6,45,15],[45,16,45,22],[45,23,45,29],[46,3,46,15],[46,16,46,22],[46,23,46,29],[43,4,43,5],[43,6,43,15],[43,16,43,22],[43,23,43,29],[44,2,45,3],[44,4,44,5],[44,6,44,15],[44,16,44,22],[44,23,44,29],[45,4,45,5],[33,2,43,3],[33,4,33,5],[33,6,33,15],[33,16,33,22],[33,23,33,29],[34,4,34,5],[34,6,34,15],[34,16,34,22],[41,4,41,5],[41,6,41,15],[41,16,41,22],[41,23,41,29],[42,4,42,5],[42,6,42,15],[42,16,42,22],[42,23,42,29],[39,4,39,5],[39,6,39,15],[39,16,39,22],[39,23,39,29],[40,4,40,5],[40,6,40,15],[40,16,40,22],[40,23,40,29],[37,4,37,5],[37,6,37,15],[37,16,37,22],[37,23,37,29],[38,4,38,5],[38,6,38,15],[38,16,38,22],[38,23,38,29],[35,6,35,15],[35,16,35,22],[35,23,35,29],[36,4,36,5],[36,6,36,15],[36,16,36,22],[36,23,36,29],[34,23,34,29],[35,4,35,5],[27,2,27,29],[29,1,29,29],[30,2,30,29],[32,2,32,15],[32,16,32,22],[32,23,32,29],[21,2,21,29],[22,2,22,29],[23,2,23,29],[24,2,24,29],[25,2,25,29],[26,2,26,29],[18,2,18,29],[19,2,19,29],[20,1,20,29],[9,1,9,29],[10,1,10,29],[11,2,11,29],[12,2,12,29],[13,2,13,29],[14,2,14,29],[0,1,0,29],[2,1,2,29],[4,1,4,29],[6,26,6,29],[7,1,7,11],[7,13,7,14],[15,2,15,29],[16,2,16,29],[17,2,17,29]]}
[null,"CENSO NACIONAL DE GOBIERNOS\nESTATALES 2026",null,null,null,null,null,null,null,null,null,null,null,null,null,null,null,null,null,null,null,null,null,null,null,null,null,null,null,null,null,null,{"$f":"IF(SUM(AG9)>0,1,0)","v":0},{"$f":"IF(SUM(AL109,AL177,AL192,AL205,AL219,AL251,AL265)>0,1,0)","v":0}]
[]
[null,"Módulo 6.\nCatastro, registro y territorio"]
[]
[null,"Sección II. Registro Público de la Propiedad"]
[]
[null,"Entidad:",null,null,null,null,null,null,null,null,null,null,null,"Clave:",null,null,null,null,null,null,null,null,null,null,null,null,"Índice"]
[null,{"$f":"IF(Índice!B9=\"\",\"\",Índice!B9)","v":""},null,null,null,null,null,null,null,null,null,null,null,{"$f":"IF(Índice!N9=\"\",\"\",Índice!N9)","v":""}]
[null,null,null,null,null,null,null,null,null,null,null,null,null,null,null,null,null,null,null,null,null,null,null,null,null,null,null,null,null,null,null,null,{"$f":"IF(SUM(AG30,AG71,AG81,AG93,AG103,AG116,AG127,AG137,AG151,AG165,AG184,AG199,AG212,AG226,AG235,AG245,AG258,AG272,AG281,AG291,AG345,AG355,AG368,AG387,AG397,AG432,AG442,AG455,AG466,AG476,AG487,AG497,AG510,AG523,AG533,AG544,AG554,AG567,AG580,AG590)=0,0,1)","v":0}]
[null,"II.4 Trámites y servicios registrales",null,null,null,null,null,null,null,null,null,null,null,null,null,null,null,null,null,null,null,null,null,null,null,null,null,null,null,null,null,null,{"$f":"IF(Índice!B9<>\"\",\"X\",\"\")","v":""}]
[null,"Instrucciones generales para las preguntas de la subsección:",null,null,null,null,null,null,null,null,null,null,null,null,null,null,null,null,null,null,null,null,null,null,null,null,null,null,null,null,null,null,"No. Municipios"]
[null,null,"1.- Periodo de referencia de los datos: \nAl cierre del año: la información se refiere a lo existente al 31 de diciembre de 2025.\nDurante el año: la información se refiere a lo existente del 1 de enero al 31 de diciembre de 2025.",null,null,null,null,null,null,null,null,null,null,null,null,null,null,null,null,null,null,null,null,null,null,null,null,null,null,null,null,null,{"$f":"IFERROR(VLOOKUP(B8,listas!A2:AD33,3,0),0)","v":0}]
[null,null,"2.- Los catálogos utilizados en el presente cuestionario corresponden a denominaciones estándar, de tal forma que si el nombre de alguna clasificación no coincide exactamente con la utilizada en su entidad federativa, debe registrar los datos en aquella que sea homóloga. "]
[null,null,"3.- En caso de que los registros con los que cuente no le permitan desglosar la información de acuerdo con los requerimientos solicitados, anote \"NS\" (No se sabe) en las celdas donde no disponga de información. En el recuadro para comentarios de cada pregunta debe proporcionar una justificación respecto del uso del \"NS\" en determinado reactivo."]
[null,null,"4.- Las cifras deben anotarse con números enteros y sin espacio de separación ni comas, independientemente de si son miles o millones. En el caso de los porcentajes, estos además deben de ir sin el símbolo %."]
[null,null,"5.- No deje celdas en blanco, salvo en los casos en que la instrucción así lo solicite. ",null,null,null,null,null,null,null,null,null,null,null,null,null,null,null,null,null,null,null,null,null,null,null,null,null,null,null,null,null,"Aux"]
[null,null,"6.- En el caso de las tablas, deben estar contestadas todas las celdas, ya sea anotando \"0\" (cero), en caso de datos numéricos, o eligiendo algún código según el formato de respuesta.",null,null,null,null,null,null,null,null,null,null,null,null,null,null,null,null,null,null,null,null,null,null,null,null,null,null,null,null,null,{"$f":"IF(Índice!B9=\"\",\"X\",\"\")","v":"X"}]
[null,null,"7.- En las preguntas con listas desplegables, seleccione la opción que corresponda a la realidad de la entidad federativa."]
[null,null,"8.- Antes de concluir el cuestionario, revise que no haya celdas rellenas con color rojo, pues dicho color indica que hay error en la información y debe de corregirse. También asegúrese de que no haya celdas con color amarillo, ya que eso significa que falta una respuesta y debe proporcionarse la información.\t"]
[null,null,"9.- ¡Importante!: recuerde que todos los datos proporcionados en el cuestionario deben corresponder a los asentados en sus registros administrativos."]
[null,"Glosario de la subsección:"]
[null,null,"1.- Alerta inmobiliaria: se refiere al servicio mediante el cual, a través de dispositivos móviles, cuentas de correo electrónico u otros medios, se notifica de forma inmediata al titular registrado sobre cualquier tipo de consulta o movimiento que se lleve a cabo sobre su predio, a efecto de alertar sobre posibles modificaciones en su situación jurídica."]
[null,null,"2.- Certificado de gravamen o libertad de gravamen: se refiere a aquel en el que se hace constar la existencia de los gravámenes reales de una finca, tales como las hipotecas, prendas y servidumbres; o bien, aquel en el que se hace constar que una finca está libre de gravámenes reales."]
[null,null,"3.- Certificado de historial registral: se refiere a aquel que contiene la descripción de un inmueble, así como las anotaciones con que cuenta una inscripción y la relación de todos los antecedentes registrales, hasta la inscripción primordial."]
[null,null,"4.- Certificado de inscripción o no inscripción de predio: se refiere a aquel que certifica que un bien inmueble determinado se encuentra inscrito en la institución registral; o bien, aquel en el que se hace constar que un bien inmueble determinado no se encuentra inscrito en la institución registral."]
[null,null,"5.- Certificado de propiedad o no propiedad: se refiere a aquel en el que se describen todos los predios pertenecientes a una persona física o moral; o bien, aquel en el que se hace constar que en los archivos de la institución registral no existe inscripción de bienes inmuebles a favor de determinada persona física o moral."]
[null,null,"6.- Certificado de única propiedad: se refiere a aquel que se expide en específico sobre un bien inmueble, que resulta ser la única propiedad inscrita de una persona física o moral en una determinada institución registral."]
[null,null,"7.- Copias certificadas: se refiere a la expedición de copias de inscripciones o de documentos agregados al apéndice, debidamente autentificados."]
[]
["2.26.-","Indique si la institución registral de la entidad federativa brindó durante el año 2025 los siguientes trámites o servicios sobre bienes inmuebles y anote cuántos se realizaron.",null,null,null,null,null,null,null,null,null,null,null,null,null,null,null,null,null,null,null,null,null,null,null,null,null,null,null,null,null,null,{"$f":"IF(AG17=\"\",IF(AND(Q34=1,OR(X34=\"\")),1,0)+IF(AND(Q35=1,OR(X35=\"\")),1,0)+IF(AND(Q36=1,OR(X36=\"\")),1,0)+IF(AND(Q37=1,OR(X37=\"\")),1,0)+IF(AND(Q38=1,OR(X38=\"\")),1,0)+IF(AND(Q39=1,OR(X39=\"\")),1,0)+IF(AND(Q40=1,OR(X40=\"\")),1,0)+IF(AND(Q41=1,OR(X41=\"\")),1,0)+IF(AND(Q42=1,OR(X42=\"\")),1,0)+IF(AND(Q43=1,OR(X43=\"\")),1,0)+IF(AND(Q44=1,OR(X44=\"\")),1,0)+IF(AND(Q45=1,OR(X45=\"\")),1,0)+IF(AND(Q46=1,OR(X46=\"\")),1,0)+IF(AND(Q47=1,OR(X47=\"\")),1,0)+IF(AND(Q48=1,OR(X48=\"\")),1,0)+IF(AND(Q49=1,OR(X49=\"\")),1,0)+IF(AND(Q50=1,OR(X50=\"\")),1,0)+IF(AND(Q51=1,OR(X51=\"\")),1,0)+IF(AND(Q52=1,OR(X52=\"\")),1,0)+IF(AND(Q53=1,OR(X53=\"\")),1,0)+IF(AND(Q54=1,OR(X54=\"\")),1,0)+IF(AND(Q55=1,OR(X55=\"\")),1,0)+IF(AND(Q56=1,OR(X56=\"\")),1,0)+IF(AND(Q57=1,OR(X57=\"\")),1,0)+IF(AND(Q58=1,OR(X58=\"\")),1,0)+IF(AND(Q59=1,OR(X59=\"\")),1,0)+IF(AND(Q60=1,OR(X60=\"\")),1,0)+IF(AND(Q61=1,OR(X61=\"\")),1,0)+IF(AND(Q62=1,OR(X62=\"\")),1,0)+IF(AND(Q63=1,OR(X63=\"\")),1,0)+IF(AND(Q64=1,OR(X64=\"\")),1,0)+IF(AND(Q65=1,OR(X65=\"\")),1,0)+IF(AND(Q66=1,OR(X66=\"\")),1,0)+IF(AND(Q67=1,OR(X67=\"\")),1,0)+IF(AND(Q68=1,OR(X68=\"\")),1,0)+IF(AND(Q69=1,OR(X69=\"\")),1,0)+COUNTBLANK(Q34)+COUNTBLANK(Q35)+COUNTBLANK(Q36)+COUNTBLANK(Q37)+COUNTBLANK(Q38)+COUNTBLANK(Q39)+COUNTBLANK(Q40)+COUNTBLANK(Q41)+COUNTBLANK(Q42)+COUNTBLANK(Q43)+COUNTBLANK(Q44)+COUNTBLANK(Q45)+COUNTBLANK(Q46)+COUNTBLANK(Q47)+COUNTBLANK(Q48)+COUNTBLANK(Q49)+COUNTBLANK(Q50)+COUNTBLANK(Q51)+COUNTBLANK(Q52)+COUNTBLANK(Q53)+COUNTBLANK(Q54)+COUNTBLANK(Q55)+COUNTBLANK(Q56)+COUNTBLANK(Q57)+COUNTBLANK(Q58)+COUNTBLANK(Q59)+COUNTBLANK(Q60)+COUNTBLANK(Q61)+COUNTBLANK(Q62)+COUNTBLANK(Q63)+COUNTBLANK(Q64)+COUNTBLANK(Q65)+COUNTBLANK(Q66)+COUNTBLANK(Q67)+COUNTBLANK(Q68)+COUNTBLANK(Q69),0)","v":0}]
[null,null,"Si responde \"1. Sí\" en el numeral 10, anote el otro trámite o servicio en el recuadro que está al final de la tabla."]
[]
[null,null,"Trámite o servicio",null,null,null,null,null,null,null,null,null,null,null,null,null,"¿Se brindó el trámite o servicio? \n(1.Sí / 2.No / \n9.No se sabe)",null,null,null,null,null,null,"Cantidad de trámites realizados"]
[null,null,"1. Traslativo de dominio",null,"1.1",null,"Adjudicación"]
[null,null,null,null,"1.2",null,"Aplicación de bienes por disolución de la sociedad conyugal"]
[null,null,null,null,"1.3",null,"Aportación de bienes a una sociedad "]
[null,null,null,null,"1.4",null,"Cesión de bien inmueble"]
[null,null,null,null,"1.5",null,"Compraventa"]
[null,null,null,null,"1.6",null,"Dación en pago"]
[null,null,null,null,"1.7",null,"Donación "]
[null,null,null,null,"1.8",null,"Fideicomiso"]
[null,null,null,null,"1.9",null,"Permuta "]
[null,null,null,null,"1.10",null,"Prescripción positiva"]
[null,null,null,null,"1.11",null,"Título de propiedad"]
[null,null,"2. Derechos reales",null,"2.1",null,"Servidumbre"]
[null,null,null,null,"2.2",null,"Usufructo"]
[null,null,"3.","Patrimonio de familia"]
[null,null,"4.","Capitulaciones matrimoniales"]
[null,null,"5. Convenios o contratos",null,"5.1",null,"Arrendamiento"]
[null,null,null,null,"5.2",null,"Comodato"]
[null,null,null,null,"5.3",null,"Convenio o contrato"]
[null,null,"6. Fusión o división",null,"6.1",null,"Constitución de régimen de propiedad en condominio"]
[null,null,null,null,"6.2",null,"División de cosa común (copropiedad)"]
[null,null,null,null,"6.3",null,"Fraccionamiento"]
[null,null,null,null,"6.4",null,"Fusión de predios"]
[null,null,null,null,"6.5",null,"Lotificación"]
[null,null,null,null,"6.6",null,"Relotificación"]
[null,null,null,null,"6.7",null,"Subdivisión"]
[null,null,"7.","Modificación de medidas y linderos"]
[null,null,"8. Gravámenes",null,"8.1",null,"Cédula hipotecaria"]
[null,null,null,null,"8.2",null,"Cesión de crédito hipotecario"]
[null,null,null,null,"8.3",null,"Constitución de reserva de dominio"]
[null,null,null,null,"8.4",null,"Crédito o hipoteca "]
[null,null,null,null,"8.5",null,"Embargo"]
[null,null,null,null,"8.6",null,"Fianza"]
[null,null,null,null,"8.7",null,"Mutuo con garantía hipotecaria"]
[null,null,null,null,"8.8",null,"Reconocimiento de adeudo"]
[null,null,"9.","Cancelaciones"]
[null,null,"10.","Otro (especifique)"]
[]
[null,null,"Otro trámite o servicio:\n(especifique)",null,null,null,null,null,null,null,null,null,null,null,null,null,null,null,null,null,null,null,null,null,null,null,null,null,null,null,null,null,{"$f":"IF(Q69=1,COUNTBLANK(G71),0)","v":0}]
[]
[null,null,"En caso de tener algún comentario u observación al dato registrado en la respuesta de la presente pregunta, o de los datos que derivan de la misma, favor de anotarlo en el siguiente espacio. De lo contrario, déjelo en blanco."]
[]
[]
[]
[]
[]
[]
[]
["2.27.-","Indique si los siguientes tipos de certificados sobre bienes inmuebles se expidieron en la institución registral de la entidad federativa durante el año 2025.",null,null,null,null,null,null,null,null,null,null,null,null,null,null,null,null,null,null,null,null,null,null,null,null,null,null,null,null,null,null,{"$f":"IF(AG17=\"\",IF(AND(Q85=1,X85=\"\"),1,0)+IF(AND(Q86=1,X86=\"\"),1,0)+IF(AND(Q87=1,X87=\"\"),1,0)+IF(AND(Q88=1,X88=\"\"),1,0)+IF(AND(Q89=1,X89=\"\"),1,0)+IF(AND(Q90=1,X90=\"\"),1,0)+IF(AND(Q91=1,X91=\"\"),1,0)+COUNTBLANK(Q85:Q91),0)","v":0}]
[null,null,"Si responde \"1. Sí\" en el numeral 7, anote el otro tipo de certificado en el recuadro que está al final de la tabla."]
[]
[null,null,"Certificados ",null,null,null,null,null,null,null,null,null,null,null,null,null,"¿Se expidió el certificado? \n(1.Sí / 2.No / 9.No se sabe)",null,null,null,null,null,null,"Cantidad de certificados expedidos"]
[null,null,"1.","Copias certificadas"]
[null,null,"2.","Gravamen o libertad de gravamen"]
[null,null,"3.","Historial registral"]
[null,null,"4.","Inscripción o no inscripción de predio"]
[null,null,"5.","Propiedad o no propiedad"]
[null,null,"6.","Única propiedad"]
[null,null,"7.","Otro (especifique)"]
[]
[null,null,"Otro tipo de certificado:\n(especifique)",null,null,null,null,null,null,null,null,null,null,null,null,null,null,null,null,null,null,null,null,null,null,null,null,null,null,null,null,null,{"$f":"IF(Q91=1,COUNTBLANK(G93),0)","v":0}]
[]
[null,null,"En caso de tener algún comentario u observación al dato registrado en la respuesta de la presente pregunta, o de los datos que derivan de la misma, favor de anotarlo en el siguiente espacio. De lo contrario, déjelo en blanco."]
[]
[]
[]
[]
[]
[]
[]
["2.28.-","Indique si durante el año 2025 en la institución registral de la entidad federativa se implementaron alertas inmobiliarias para notificar al titular cuando se dio inicio a un trámite que afectó a su predio.",null,null,null,null,null,null,null,null,null,null,null,null,null,null,null,null,null,null,null,null,null,null,null,null,null,null,null,null,null,null,{"$f":"IF(AG17=\"\",IF(COUNTBLANK(C106)+COUNTBLANK(I106)+COUNTBLANK(T106)=3,1,0),0)","v":0}]
[null,null,"Seleccione con \"X\" un solo código."]
[]
[null,null,null,"1. Sí",null,null,null,null,null,"2. No (pase a la pregunta 2.30)",null,null,null,null,null,null,null,null,null,null,"9. No se sabe (pase a la pregunta 2.30)"]
[]
[null,null,"En caso de tener algún comentario u observación al dato registrado en la respuesta de la presente pregunta, o de los datos que derivan de la misma, favor de anotarlo en el siguiente espacio. De lo contrario, déjelo en blanco."]
[null,null,null,null,null,null,null,null,null,null,null,null,null,null,null,null,null,null,null,null,null,null,null,null,null,null,null,null,null,null,null,null,null,null,null,null,0,{"$f":"IF(AK109=1,COUNTBLANK(C109),0)","v":0}]
[]
[]
[]
[]
[]
[]
["2.29.-","Seleccione los medios que se utilizaron para notificar al titular.",null,null,null,null,null,null,null,null,null,null,null,null,null,null,null,null,null,null,null,null,null,null,null,null,null,null,null,null,null,null,{"$f":"IF(UPPER(C106)=\"X\",IF(COUNTBLANK(C121:C125)=5,1,0), 0)","v":0}]
[null,null,"Puede seleccionar con \"X\" más de un código."]
[null,null,"Si marca el numeral 4, anote el otro medio en el recuadro que se encuentra al final de la lista."]
[null,null,"Si elige el numeral 9, no marque otro código."]
[]
[null,null,null,"1. Mensaje de texto"]
[null,null,null,"2. Correo electrónico"]
[null,null,null,"3. Aplicación móvil "]
[null,null,null,"4. Otro (especifique)"]
[null,null,null,"9. No se sabe"]
[]
[null,null,"Otro medio:\n(especifique)",null,null,null,null,null,null,null,null,null,null,null,null,null,null,null,null,null,null,null,null,null,null,null,null,null,null,null,null,null,{"$f":"IF(UPPER(C124=\"X\"),COUNTBLANK(G127),0)","v":0}]
[]
[null,null,"En caso de tener algún comentario u observación al dato registrado en la respuesta de la presente pregunta, o de los datos que derivan de la misma, favor de anotarlo en el siguiente espacio. De lo contrario, déjelo en blanco."]
[]
[]
[]
[]
[]
[]
[]
["2.30.-","Indique si la institución registral de la entidad federativa estableció convenios de servicios electrónicos con los siguientes usuarios durante el año 2025.",null,null,null,null,null,null,null,null,null,null,null,null,null,null,null,null,null,null,null,null,null,null,null,null,null,null,null,null,null,null,{"$f":"IF(AG17=\"\",IF(COUNTBLANK(Z141:Z149)>0,1,0),0)","v":0}]
[null,null,"Si responde \"1. Sí\" en el numeral 9, anote el otro usuario en el recuadro que está al final de la tabla."]
[]
[null,null,"Usuarios",null,null,null,null,null,null,null,null,null,null,null,null,null,null,null,null,null,null,null,null,null,null,"¿Estableció convenio?\n(1.Sí / 2.No / 9.No se sabe)"]
[null,null,"1.","INFONAVIT"]
[null,null,"2.","INSUS"]
[null,null,"3.","SAT"]
[null,null,"4.","Instituciones catastrales"]
[null,null,"5.","Municipios"]
[null,null,"6.","Poder judicial estatal y/ o federal"]
[null,null,"7.","Procuraduría y/ o fiscalía estatal de justicia"]
[null,null,"8.","Notarios"]
[null,null,"9.","Otro (especifique)"]
[]
[null,null,"Otro usuario:\n(especifique)",null,null,null,null,null,null,null,null,null,null,null,null,null,null,null,null,null,null,null,null,null,null,null,null,null,null,null,null,null,{"$f":"IF(Z149=1,COUNTBLANK(G151),0)","v":0}]
[]
[null,null,"En caso de tener algún comentario u observación al dato registrado en la respuesta de la presente pregunta, o de los datos que derivan de la misma, favor de anotarlo en el siguiente espacio. De lo contrario, déjelo en blanco."]
[]
[]
[]
[]
[]
[]
[]
[null,"II.4.1 Inscripciones registrales"]
[null,"Glosario del apartado:"]
[null,null,"1.- Inscripciones registrales: se refiere a aquellos asientos o inscripciones en los que quedan registrados los movimientos que sufren los bienes inmuebles, bienes muebles, actos mercantiles, personas morales de carácter civil o mercantil, entre otros y que pueden o no formar parte de un folio real físico o un folio real electrónico."]
[]
["2.31.-","Anote, conforme a la siguiente tabla, el universo de inscripciones registrales, legajos y/ o libros generados, así como el porcentaje de los que se encontraban en formato digital y/ o físico al cierre del año 2025. ",null,null,null,null,null,null,null,null,null,null,null,null,null,null,null,null,null,null,null,null,null,null,null,null,null,null,null,null,null,null,{"$f":"IF(AG17=\"\",IF(AND(P172>0,UPPER(P172)<>\"NS\",OR(U172=\"\",Z172=\"\")),1,0)+IF(AND(P173>0,UPPER(P173)<>\"NS\",OR(U173=\"\",Z173=\"\")),1,0)+IF(AND(P174>0,UPPER(P174)<>\"NS\",OR(U174=\"\",Z174=\"\")),1,0)+COUNTBLANK(P172:P174),0)","v":0}]
[null,null,"Si desconoce alguna cantidad, registre \"NS\" en la celda correspondiente."]
[null,null,"Registre el porcentaje de los formatos en números enteros sin el símbolo de porcentaje (%)."]
[null,null,"Los porcentajes registrados en las columnas de formato digital y físico no son sumables. En cada una de ellas puede registrar hasta el 100% si es el caso."]
[]
[null,null,"Elementos",null,null,null,null,null,null,null,null,null,null,null,null,"Universo",null,null,null,null,"Formato"]
[null,null,null,null,null,null,null,null,null,null,null,null,null,null,null,null,null,null,null,null,"% Digital",null,null,null,null,"% Físico"]
[null,null,"1.","Inscripciones registrales",null,null,null,null,null,null,null,null,null,null,null,null,null,null,null,null,null,null,null,null,null,null,null,null,null,null,null,null,0,0,0]
[null,null,"2.","Legajos",null,null,null,null,null,null,null,null,null,null,null,null,null,null,null,null,null,null,null,null,null,null,null,null,null,null,null,null,0,0,0]
[null,null,"3.","Libros",null,null,null,null,null,null,null,null,null,null,null,null,null,null,null,null,null,null,null,null,null,null,null,null,null,null,null,null,0,0,0]
[]
[null,null,"En caso de tener algún comentario u observación al dato registrado en la respuesta de la presente pregunta, o de los datos que derivan de la misma, favor de anotarlo en el siguiente espacio. De lo contrario, déjelo en blanco."]
[null,null,null,null,null,null,null,null,null,null,null,null,null,null,null,null,null,null,null,null,null,null,null,null,null,null,null,null,null,null,null,null,{"$f":"SUM(AG172+AH172+AI172+AG173+AH173+AI173+AG174+AH174+AI174)","v":0},null,null,null,1,{"$f":"IF(OR(AG172=1,AH172=1,AI172=1,AG173=1,AH173=1,AI173=1,AG174=1,AH174=1,AI174=1),COUNTBLANK(C177),0)","v":0}]
[]
[]
[]
[]
[]
[]
["2.32.-","Anote la cantidad total de bienes inmuebles vigentes que han sido inscritos en la institución registral de la entidad federativa al cierre del año 2025.",null,null,null,null,null,null,null,null,null,null,null,null,null,null,null,null,null,null,null,null,null,null,null,null,null,null,null,null,null,null,{"$f":"IF(AG17=\"\",IF(COUNTBLANK(C189)+COUNTBLANK(N189)=2,1,0),0)","v":0}]
[null,null,"Registre la cantidad de bienes inmuebles vigentes que han sido inscritos omitiendo duplicados."]
[null,null,"La cantidad debe registrarse con números enteros y sin comas."]
[null,null,"Si anotó una cantidad, llene el \"Complemento 1\" realizando el desglose de  bienes inmuebles vigentes por municipio/demarcación territorial. Si tuvo bienes inmuebles vigentes inscritos de los cuales desconoce a que municipio pertenecen, utilice la clasificación \"Sin municipio identificado\" para registrar la cantidad de estos."]
[]
[null,null,null,null,null,null,null,null,null,null,null,"",null,null,"9. No se sabe"]
[]
[null,null,"En caso de tener algún comentario u observación al dato registrado en la respuesta de la presente pregunta, o de los datos que derivan de la misma, favor de anotarlo en el siguiente espacio. De lo contrario, déjelo en blanco."]
[null,null,null,null,null,null,null,null,null,null,null,null,null,null,null,null,null,null,null,null,null,null,null,null,null,null,null,null,null,null,null,null,null,null,null,null,0,{"$f":"IF(AK192=1,COUNTBLANK(C192),0)","v":0}]
[]
[]
[]
[]
[]
[]
["2.33.-","Indique si se implementó el folio real físico en la institución registral de la entidad federativa durante el año 2025.",null,null,null,null,null,null,null,null,null,null,null,null,null,null,null,null,null,null,null,null,null,null,null,null,null,null,null,null,null,null,{"$f":"IF(AG17=\"\",IF(COUNTBLANK(C202)+COUNTBLANK(I202)+COUNTBLANK(T202)=3,1,0),0)","v":0}]
[null,null,"Seleccione con \"X\" un solo código."]
[]
[null,null,null,"1. Sí",null,null,null,null,null,"2. No (pase a la pregunta 2.36)",null,null,null,null,null,null,null,null,null,null,"9. No se sabe (pase a la pregunta 2.36)"]
[]
[null,null,"En caso de tener algún comentario u observación al dato registrado en la respuesta de la presente pregunta, o de los datos que derivan de la misma, favor de anotarlo en el siguiente espacio. De lo contrario, déjelo en blanco."]
[null,null,null,null,null,null,null,null,null,null,null,null,null,null,null,null,null,null,null,null,null,null,null,null,null,null,null,null,null,null,null,null,null,null,null,null,0,{"$f":"IF(AK205=1,COUNTBLANK(C205),0)","v":0}]
[]
[]
[]
[]
[]
[]
["2.34.-","Anote la cantidad total de folios reales físicos generados en la institución registral de la entidad federativa al cierre del año 2025.",null,null,null,null,null,null,null,null,null,null,null,null,null,null,null,null,null,null,null,null,null,null,null,null,null,null,null,null,null,null,{"$f":"IF(UPPER(C202)=\"X\",IF(COUNTBLANK(C216)+COUNTBLANK(N216)=2,1,0),0)","v":0}]
[null,null,"Registre la cantidad de folios reales físicos vigentes generados, omitiendo duplicados."]
[null,null,"La cantidad debe registrarse con números enteros y sin comas."]
[]
[null,null,null,null,null,null,null,null,null,null,null,"",null,null,"9. No se sabe  (pase a la pregunta 2.36)"]
[]
[null,null,"En caso de tener algún comentario u observación al dato registrado en la respuesta de la presente pregunta, o de los datos que derivan de la misma, favor de anotarlo en el siguiente espacio. De lo contrario, déjelo en blanco."]
[null,null,null,null,null,null,null,null,null,null,null,null,null,null,null,null,null,null,null,null,null,null,null,null,null,null,null,null,null,null,null,null,null,null,null,null,0,{"$f":"IF(AK219=1,COUNTBLANK(C219),0)","v":0}]
[]
[]
[]
[]
[]
[]
["2.35.-","Anote la cantidad total de folios reales físicos por tipo, generados en la institución registral de la entidad federativa al cierre del año 2025.",null,null,null,null,null,null,null,null,null,null,null,null,null,null,null,null,null,null,null,null,null,null,null,null,null,null,null,null,null,null,{"$f":"IF(AND(C216>0,C216<>\"\"),COUNTBLANK(K233)+COUNTBLANK(O233)+COUNTBLANK(S233)+COUNTBLANK(W233)+COUNTBLANK(AA233),0)","v":0}]
[null,null,"La cantidad total de folios reales físicos debe ser igual a la registrada como respuesta de la pregunta 2.34."]
[null,null,"Si registra una cantidad mayor a cero en la columna \"Otro\", anote el otro tipo de folio real físico en el recuadro que se encuentra al final de la tabla."]
[]
[null,null,"Tipo de folio real físico"]
[null,null,"Total de folios",null,null,null,null,null,null,null,"Subtotal "]
[null,null,null,null,null,null,null,null,null,null,"Folio inmobiliario",null,null,null,"Folio mobiliario",null,null,null,"Folio de persona moral de carácter civil",null,null,null,"Otro",null,null,null,"Sin clasificación"]
[null,null,{"$f":"IF(C216<>\"\",C216,\"\")","v":""}]
[]
[null,null,"Otro tipo de folio real físico:\n(especifique)",null,null,null,null,null,null,null,null,null,null,null,null,null,null,null,null,null,null,null,null,null,null,null,null,null,null,null,null,null,{"$f":"IF(AND(W233>0,W233<>\"\"),COUNTBLANK(G235),0)","v":0}]
[]
[null,null,"En caso de tener algún comentario u observación al dato registrado en la respuesta de la presente pregunta, o de los datos que derivan de la misma, favor de anotarlo en el siguiente espacio. De lo contrario, déjelo en blanco."]
[]
[]
[]
[]
[]
[]
[]
["2.36.-","Indique si se implementó el folio real electrónico en la institución registral de la entidad federativa durante el año 2025.",null,null,null,null,null,null,null,null,null,null,null,null,null,null,null,null,null,null,null,null,null,null,null,null,null,null,null,null,null,null,{"$f":"IF(AG17=\"\",IF(COUNTBLANK(C248)+COUNTBLANK(I248)+COUNTBLANK(T248)=3,1,0),0)","v":0}]
[null,null,"Seleccione con \"X\" un solo código."]
[]
[null,null,null,"1. Sí",null,null,null,null,null,"2. No (pase a la pregunta 2.40)",null,null,null,null,null,null,null,null,null,null,"9. No se sabe (pase a la pregunta 2.40)",null,null,null,null,null,null,null,null,null,null,null,null,null,null,null,0]
[]
[null,null,"En caso de tener algún comentario u observación al dato registrado en la respuesta de la presente pregunta, o de los datos que derivan de la misma, favor de anotarlo en el siguiente espacio. De lo contrario, déjelo en blanco."]
[null,null,null,null,null,null,null,null,null,null,null,null,null,null,null,null,null,null,null,null,null,null,null,null,null,null,null,null,null,null,null,null,null,null,null,null,0,{"$f":"IF(AK251=1,COUNTBLANK(C251),0)","v":0}]
[]
[]
[]
[]
[]
[]
["2.37.-","Anote la cantidad total de folios reales electrónicos generados en la institución registral de la entidad federativa al cierre del año 2025.",null,null,null,null,null,null,null,null,null,null,null,null,null,null,null,null,null,null,null,null,null,null,null,null,null,null,null,null,null,null,{"$f":"IF(UPPER(C248)=\"X\",IF(COUNTBLANK(C262)+COUNTBLANK(N262)=2,1,0),0)","v":0}]
[null,null,"Registre la cantidad de folios reales electrónicos vigentes generados, omitiendo duplicados."]
[null,null,"La cantidad debe registrarse con números enteros y sin comas."]
[]
[null,null,null,null,null,null,null,null,null,null,null,"",null,null,"9. No se sabe  (pase a la pregunta 2.39)"]
[]
[null,null,"En caso de tener algún comentario u observación al dato registrado en la respuesta de la presente pregunta, o de los datos que derivan de la misma, favor de anotarlo en el siguiente espacio. De lo contrario, déjelo en blanco."]
[null,null,null,null,null,null,null,null,null,null,null,null,null,null,null,null,null,null,null,null,null,null,null,null,null,null,null,null,null,null,null,null,null,null,null,null,0,{"$f":"IF(AK265=1,COUNTBLANK(C265),0)","v":0}]
[]
[]
[]
[]
[]
[]
["2.38.-","Anote la cantidad total de folios reales electrónicos por tipo, generados en la institución registral de la entidad federativa al cierre del año 2025.",null,null,null,null,null,null,null,null,null,null,null,null,null,null,null,null,null,null,null,null,null,null,null,null,null,null,null,null,null,null,{"$f":"IF(AND(C262>0,C262<>\"\"),COUNTBLANK(K279)+COUNTBLANK(O279)+COUNTBLANK(S279)+COUNTBLANK(W279)+COUNTBLANK(AA279),0)","v":0}]
[null,null,"La cantidad total de folios reales electrónicos debe ser igual a la registrada como respuesta de la pregunta 2.37."]
[null,null,"Si registra una cantidad mayor a cero en la columna \"Otro\", anote el otro tipo de folio real electrónico en el recuadro que se encuentra al final de la tabla."]
[]
[null,null,"Tipo de folio real electrónico"]
[null,null,"Total de folios",null,null,null,null,null,null,null,"Subtotal "]
[null,null,null,null,null,null,null,null,null,null,"Folio inmobiliario",null,null,null,"Folio mobiliario",null,null,null,"Folio de persona moral de carácter civil",null,null,null,"Otro",null,null,null,"Sin clasificación"]
[null,null,{"$f":"IF(C262<>\"\",C262,\"\")","v":""}]
[]
[null,null,"Otro tipo de folio real electrónico:\n(especifique)",null,null,null,null,null,null,null,null,null,null,null,null,null,null,null,null,null,null,null,null,null,null,null,null,null,null,null,null,null,{"$f":"IF(AND(W279>0,W279<>\"\"),COUNTBLANK(G281),0)","v":0}]
[]
[null,null,"En caso de tener algún comentario u observación al dato registrado en la respuesta de la presente pregunta, o de los datos que derivan de la misma, favor de anotarlo en el siguiente espacio. De lo contrario, déjelo en blanco."]
[]
[]
[]
[]
[]
[]
[]
["2.39.-","Indique si los siguientes componentes integraron el folio real electrónico durante el año 2025. ",null,null,null,null,null,null,null,null,null,null,null,null,null,null,null,null,null,null,null,null,null,null,null,null,null,null,null,null,null,null,{"$f":"IF(UPPER(C248)=\"X\",IF(AND(Z296=1,OR(Z297=\"\",Z298=\"\",Z299=\"\",Z300=\"\",Z301=\"\",Z302=\"\",Z303=\"\",Z304=\"\",Z305=\"\",Z306=\"\",Z307=\"\",Z308=\"\",Z309=\"\",Z310=\"\",Z311=\"\",Z312=\"\")),1,0)+IF(AND(Z313=1,OR(Z314=\"\",Z315=\"\")),1,0)+IF(AND(Z316=1,OR(Z317=\"\",Z318=\"\",Z319=\"\",Z320=\"\",Z321=\"\",Z322=\"\",Z323=\"\")),1,0)+IF(AND(Z324=1,OR(Z325=\"\",Z326=\"\",Z327=\"\",Z328=\"\",Z329=\"\",Z330=\"\",Z331=\"\")),1,0)+IF(AND(Z332=1,OR(Z333=\"\",Z334=\"\",Z335=\"\",Z336=\"\",Z337=\"\")),1,0)+IF(AND(Z338=\"\",Z339=\"\",Z340=\"\",Z341=\"\",Z342=\"\",Z343=\"\"),1,0)+COUNTBLANK(Z295)+COUNTBLANK(Z296)+COUNTBLANK(Z313)+COUNTBLANK(Z316)+COUNTBLANK(Z324)+COUNTBLANK(Z332)+COUNTBLANK(Z338)+COUNTBLANK(Z339)+COUNTBLANK(Z340)+COUNTBLANK(Z341)+COUNTBLANK(Z342)+COUNTBLANK(Z343),0)","v":0}]
[null,null,"Si responde \"1. Sí\" en el numeral 12, anote el otro componente en el recuadro que se encuentra al final de la tabla."]
[]
[null,null,"Componentes del folio real electrónico",null,null,null,null,null,null,null,null,null,null,null,null,null,null,null,null,null,null,null,null,null,null,"¿Integró el folio real electrónico?\n(1.Sí / 2.No / 9.No se sabe)"]
[null,null,"1.","Clave numérica o alfanumérica para identificación del folio"]
[null,null,"2.","Datos de identificación"]
[null,null,"2.1",null,"Clave catastral estándar"]
[null,null,"2.2",null,"Cuenta predial"]
[null,null,"2.3",null,"Superficie"]
[null,null,"2.4",null,"Linderos"]
[null,null,"2.5",null,"Medidas"]
[null,null,"2.6",null,"Colindancias"]
[null,null,"2.7",null,"Calle o vialidad"]
[null,null,"2.8",null,"Número exterior"]
[null,null,"2.9",null,"Número interior"]
[null,null,"2.10",null,"Edificio"]
[null,null,"2.11",null,"Lote"]
[null,null,"2.12",null,"Manzana "]
[null,null,"2.13",null,"Colonia, fraccionamiento o condominio"]
[null,null,"2.14",null,"Localidad"]
[null,null,"2.15",null,"Municipio"]
[null,null,"2.16",null,"Entidad federativa"]
[null,null,"3.","Titularidad"]
[null,null,"3.1",null,"Nombre del titular"]
[null,null,"3.2",null,"Razón social en caso de persona moral como titular "]
[null,null,"4.","Datos de la última inscripción"]
[null,null,"4.1",null,"Oficina"]
[null,null,"4.2",null,"Sección"]
[null,null,"4.3",null,"Libro "]
[null,null,"4.4",null,"Año"]
[null,null,"4.5",null,"Volumen"]
[null,null,"4.6",null,"Número de asiento o inscripción"]
[null,null,"4.7",null,"Fecha de registro"]
[null,null,"5.","Antecedentes"]
[null,null,"5.1",null,"Folio originario/matriz"]
[null,null,"5.2",null,"Oficina"]
[null,null,"5.3",null,"Sección"]
[null,null,"5.4",null,"Libro "]
[null,null,"5.5",null,"Año"]
[null,null,"5.6",null,"Volumen"]
[null,null,"5.7",null,"Número de asiento o inscripción"]
[null,null,"6.","Datos notariales"]
[null,null,"6.1",null,"Notario o autoridad competente que emitió el documento"]
[null,null,"6.2",null,"Folio del asiento o inscripción notarial"]
[null,null,"6.3",null,"Libro notarial"]
[null,null,"6.4",null,"Fecha del instrumento notarial"]
[null,null,"6.5",null,"Número del instrumento notarial"]
[null,null,"7.","Formas precodificadas para las nuevas inscripciones"]
[null,null,"8.","Formas precodificadas para las anotaciones preventivas"]
[null,null,"9.","Formas precodificadas para las anotaciones marginales"]
[null,null,"10.","Gravámenes vigentes"]
[null,null,"11.","Imágenes digitalizadas asociadas y/ o indexadas"]
[null,null,"12.","Otro (especifique)"]
[]
[null,null,"Otro componente:\n(especifique)",null,null,null,null,null,null,null,null,null,null,null,null,null,null,null,null,null,null,null,null,null,null,null,null,null,null,null,null,null,{"$f":"IF(Z343=1,COUNTBLANK(G345),0)","v":0}]
[]
[null,null,"En caso de tener algún comentario u observación al dato registrado en la respuesta de la presente pregunta, o de los datos que derivan de la misma, favor de anotarlo en el siguiente espacio. De lo contrario, déjelo en blanco."]
[]
[]
[]
[]
[]
[]
[]
["2.40.-","Indique si en la institución registral de la entidad federativa se implementó el uso de la Cédula Única Catastral y Registral establecida en la Norma Técnica para la Generación, Captación e Integración de Datos Catastrales y Registrales con fines estadísticos y geográficos del INEGI durante el año 2025.",null,null,null,null,null,null,null,null,null,null,null,null,null,null,null,null,null,null,null,null,null,null,null,null,null,null,null,null,null,null,{"$f":"IF(AG17=\"\",IF(COUNTBLANK(C358)+COUNTBLANK(I358)+COUNTBLANK(T358)=3,1,0),0)","v":0}]
[null,null,"Seleccione con \"X\" un solo código."]
[]
[null,null,null,"1. Sí",null,null,null,null,null,"2. No ",null,null,null,null,null,null,null,null,null,null,"9. No se sabe"]
[]
[null,null,"En caso de tener algún comentario u observación al dato registrado en la respuesta de la presente pregunta, o de los datos que derivan de la misma, favor de anotarlo en el siguiente espacio. De lo contrario, déjelo en blanco."]
[]
[]
[]
[]
[]
[]
[]
["2.41.-","Seleccione los tipos de anotaciones preventivas que se realizaron en la institución registral de la entidad federativa durante el año 2025.",null,null,null,null,null,null,null,null,null,null,null,null,null,null,null,null,null,null,null,null,null,null,null,null,null,null,null,null,null,null,{"$f":"IF(AG17=\"\",IF(COUNTBLANK(C373:C385)=13,1,0),0)","v":0}]
[null,null,"Puede seleccionar con \"X\" más de un código."]
[null,null,"Si marca el numeral 11, anote el otro tipo de anotación preventiva en el recuadro que se encuentra al final de la lista."]
[null,null,"Si elige el numeral 12 o el 99, no marque otro código."]
[]
[null,null,null,"1. Las demandas relativas a la propiedad de bienes inmuebles o a la constitución, declaración, modificación o extinción de cualquier derecho real sobre aquellos"]
[null,null,null,"2. El mandamiento y el acta de embargo, que se haya hecho efectivo en bienes inmuebles del deudor"]
[null,null,null,"3. Las demandas promovidas para exigir el cumplimiento de contratos preparatorios o para dar forma legal al acto o contrato concertado, cuando tenga por objeto inmuebles o derechos reales sobre los mismos"]
[null,null,null,"4. Las providencias judiciales que ordenen el secuestro o prohíban la enajenación de bienes inmuebles o derechos reales"]
[null,null,null,"5. Los títulos presentados a la institución registral y cuya inscripción haya sido denegada o suspendida por el registrador"]
[null,null,null,"6. Las anotaciones notariales"]
[null,null,null,"7. La declaración de expropiación"]
[null,null,null,"8. La declaración de utilidad pública"]
[null,null,null,"9. Las fianzas legales o judiciales"]
[null,null,null,"10. Las cédulas hipotecarias"]
[null,null,null,"11. Otro (especifique)"]
[null,null,null,"12. Ninguno"]
[null,null,null,"99. No se sabe"]
[]
[null,null,"Otro tipo de anotación preventiva:\n(especifique)",null,null,null,null,null,null,null,null,null,null,null,null,null,null,null,null,null,null,null,null,null,null,null,null,null,null,null,null,null,{"$f":"IF(UPPER(C383=\"X\"),COUNTBLANK(G387),0)","v":0}]
[]
[null,null,"En caso de tener algún comentario u observación al dato registrado en la respuesta de la presente pregunta, o de los datos que derivan de la misma, favor de anotarlo en el siguiente espacio. De lo contrario, déjelo en blanco."]
[]
[]
[]
[]
[]
[]
[]
["2.42.-","Seleccione los tipos de anotaciones marginales que se realizaron en la institución registral de la entidad federativa durante el año 2025.",null,null,null,null,null,null,null,null,null,null,null,null,null,null,null,null,null,null,null,null,null,null,null,null,null,null,null,null,null,null,{"$f":"IF(AG17=\"\",IF(COUNTBLANK(C402:C430)=29,1,0),0)","v":0}]
[null,null,"Puede seleccionar con \"X\" más de un código."]
[null,null,"Si marca el numeral 27, anote el otro tipo de anotación marginal en el recuadro que está al final de la lista."]
[null,null,"Si elige el numeral 28 o el 99, no marque otro código."]
[]
[null,null,null,"1. Las anotaciones marginales de preferencia o prelación registral"]
[null,null,null,"2. Las anotaciones de embargo"]
[null,null,null,"3. Las anotaciones relativas al otorgamiento de fianzas y cancelación de las mismas"]
[null,null,null,"4. Las anotaciones de referencia de otras inscripciones que tengan relación con la principal a la que se refieren"]
[null,null,null,"5. Las cancelaciones de las anotaciones marginales y de las inscripciones definitivas"]
[null,null,null,"6. La cancelación de una inscripción o anotación preventiva"]
[null,null,null,"7. Las suspensiones provisionales, preventivas o definitivas provenientes de juicios de amparo"]
[null,null,null,"8. Los acuerdos emitidos en cumplimiento de una ejecutoria de amparo, cuando proceda"]
[null,null,null,"9. El acuerdo en que se impugne alguna inscripción hecha en la institución ordenada por la autoridad competente"]
[null,null,null,"10. El escrito del usuario por el que presentó recurso ante la autoridad competente, ante la negativa de inscripción o cancelación, solicitando a la autoridad registral que prolongue los efectos de la anotación marginal preventiva de preferencia"]
[null,null,null,"11. Las resoluciones en que se admita una demanda, cuyos efectos, en caso de prosperar, alteren la situación jurídica de los bienes o derechos cuya inscripción sea indispensable en la institución registral"]
[null,null,null,"12. Las resoluciones emitidas por la autoridad competente, aclarando, rectificando o modificando el acto celebrado y su declaración registral"]
[null,null,null,"13. Las órdenes de intervención sobre determinada inscripción que realicen las autoridades competentes o por el ministerio público"]
[null,null,null,"14. Los testimonios en alcance que emita el notario, aclarando o rectificando un error cometido al celebrar el acto inscrito"]
[null,null,null,"15. El título traslativo de dominio de un inmueble perteneciente a un fraccionamiento o parte de él"]
[null,null,null,"16. Los derechos reales"]
[null,null,null,"17. La división de una finca"]
[null,null,null,"18. Los testamentos, los autos declaratorios de herederos, el nombramiento de albacea definitivo, el auto por el cual se le discierna el cargo"]
[null,null,null,"19. Las cesiones de derechos hereditarios en concreto y en abstracto"]
[null,null,null,"20. Las capitulaciones matrimoniales"]
[null,null,null,"21. Los contratos de arrendamiento"]
[null,null,null,"22. Los planes de desarrollo urbano"]
[null,null,null,"23. Los derechos de uso respecto de inmuebles de propiedad federal"]
[null,null,null,"24. Las rectificaciones"]
[null,null,null,"25. Las segregaciones o subdivisiones"]
[null,null,null,"26. Las transmisiones"]
[null,null,null,"27. Otro (especifique)"]
[null,null,null,"28. Ninguno"]
[null,null,null,"99. No se sabe"]
[]
[null,null,"Otro tipo de anotación marginal: \n(especifique)",null,null,null,null,null,null,null,null,null,null,null,null,null,null,null,null,null,null,null,null,null,null,null,null,null,null,null,null,null,{"$f":"IF(UPPER(C428=\"X\"),COUNTBLANK(G432),0)","v":0}]
[]
[null,null,"En caso de tener algún comentario u observación al dato registrado en la respuesta de la presente pregunta, o de los datos que derivan de la misma, favor de anotarlo en el siguiente espacio. De lo contrario, déjelo en blanco."]
[]
[]
[]
[]
[]
[]
[]
["2.43.-","Indique si durante el año 2025 en la institución registral de la entidad federativa se realizó la rectificación de asientos o inscripciones registrales.",null,null,null,null,null,null,null,null,null,null,null,null,null,null,null,null,null,null,null,null,null,null,null,null,null,null,null,null,null,null,{"$f":"IF(AG17=\"\",IF(COUNTBLANK(C445)+COUNTBLANK(I445)+COUNTBLANK(T445)=3,1,0),0)","v":0}]
[null,null,"Seleccione con \"X\" un solo código."]
[]
[null,null,null,"1. Sí",null,null,null,null,null,"2. No (pase a la pregunta 2.46)",null,null,null,null,null,null,null,null,null,null,"9. No se sabe (pase a la pregunta 2.46)"]
[]
[null,null,"En caso de tener algún comentario u observación al dato registrado en la respuesta de la presente pregunta, o de los datos que derivan de la misma, favor de anotarlo en el siguiente espacio. De lo contrario, déjelo en blanco."]
[]
[]
[]
[]
[]
[]
[]
["2.44.-","Seleccione los medios por los cuales se inició la rectificación de asientos o inscripciones registrales durante el año 2025.",null,null,null,null,null,null,null,null,null,null,null,null,null,null,null,null,null,null,null,null,null,null,null,null,null,null,null,null,null,null,{"$f":"IF(UPPER(C445)=\"X\",IF(COUNTBLANK(C460:C464)=5,1,0), 0)","v":0}]
[null,null,"Puede seleccionar con \"X\" más de un código."]
[null,null,"Si marca el numeral 4, anote el otro medio en el recuadro que está al final de la lista."]
[null,null,"Si elige el numeral 9, no marque otro código."]
[]
[null,null,null,"1. De oficio"]
[null,null,null,"2. A petición de parte"]
[null,null,null,"3. Por orden judicial o administrativa"]
[null,null,null,"4. Otro (especifique)"]
[null,null,null,"9. No se sabe"]
[]
[null,null,"Otro medio:\n(especifique)",null,null,null,null,null,null,null,null,null,null,null,null,null,null,null,null,null,null,null,null,null,null,null,null,null,null,null,null,null,{"$f":"IF(UPPER(C463=\"X\"),COUNTBLANK(G466),0)","v":0}]
[]
[null,null,"En caso de tener algún comentario u observación al dato registrado en la respuesta de la presente pregunta, o de los datos que derivan de la misma, favor de anotarlo en el siguiente espacio. De lo contrario, déjelo en blanco."]
[]
[]
[]
[]
[]
[]
[]
["2.45.-","Seleccione las formas en que se realizó la rectificación de asientos o inscripciones registrales durante el año 2025.",null,null,null,null,null,null,null,null,null,null,null,null,null,null,null,null,null,null,null,null,null,null,null,null,null,null,null,null,null,null,{"$f":"IF(UPPER(C445)=\"X\",IF(COUNTBLANK(C481:C485)=5,1,0), 0)","v":0}]
[null,null,"Puede seleccionar con \"X\" más de un código."]
[null,null,"Si marca el numeral 4, anote la otra forma en el recuadro que está al final de la lista."]
[null,null,"Si elige el numeral 9, no marque otro código."]
[]
[null,null,null,"1. Sobre la misma inscripción"]
[null,null,null,"2. Generando una nueva inscripción"]
[null,null,null,"3. Generando una nueva inscripción correlacionada con la sujeta a rectificación"]
[null,null,null,"4. Otra (especifique)"]
[null,null,null,"9. No se sabe"]
[]
[null,null,"Otra forma:\n(especifique)",null,null,null,null,null,null,null,null,null,null,null,null,null,null,null,null,null,null,null,null,null,null,null,null,null,null,null,null,null,{"$f":"IF(UPPER(C484=\"X\"),COUNTBLANK(G487),0)","v":0}]
[]
[null,null,"En caso de tener algún comentario u observación al dato registrado en la respuesta de la presente pregunta, o de los datos que derivan de la misma, favor de anotarlo en el siguiente espacio. De lo contrario, déjelo en blanco."]
[]
[]
[]
[]
[]
[]
[]
["2.46.-","Indique si durante el año 2025 en la institución registral de la entidad federativa se realizó la reposición de asientos o inscripciones registrales.",null,null,null,null,null,null,null,null,null,null,null,null,null,null,null,null,null,null,null,null,null,null,null,null,null,null,null,null,null,null,{"$f":"IF(AG17=\"\",IF(COUNTBLANK(C500)+COUNTBLANK(I500)+COUNTBLANK(T500)=3,1,0),0)","v":0}]
[null,null,"Seleccione con \"X\" un solo código."]
[]
[null,null,null,"1. Sí",null,null,null,null,null,"2. No (pase a la pregunta 2.49)",null,null,null,null,null,null,null,null,null,null,"9. No se sabe (pase a la pregunta 2.49)"]
[]
[null,null,"En caso de tener algún comentario u observación al dato registrado en la respuesta de la presente pregunta, o de los datos que derivan de la misma, favor de anotarlo en el siguiente espacio. De lo contrario, déjelo en blanco."]
[]
[]
[]
[]
[]
[]
[]
["2.47.-","Seleccione los motivos por los cuales se inició la reposición de asientos o inscripciones registrales durante el año 2025.",null,null,null,null,null,null,null,null,null,null,null,null,null,null,null,null,null,null,null,null,null,null,null,null,null,null,null,null,null,null,{"$f":"IF(UPPER(C500)=\"X\",IF(COUNTBLANK(C515:C521)=7,1,0), 0)","v":0}]
[null,null,"Puede seleccionar con \"X\" más de un código."]
[null,null,"Si marca el numeral 6, anote el otro motivo en el recuadro que está al final de la lista."]
[null,null,"Si elige el numeral 9, no marque otro código."]
[]
[null,null,null,"1. Alteración"]
[null,null,null,"2. Destrucción total o parcial (mutilación)"]
[null,null,null,"3. Deterioro"]
[null,null,null,"4. Error en el asiento o inscripción"]
[null,null,null,"5. Pérdida y/ o extravío"]
[null,null,null,"6. Otro (especifique)"]
[null,null,null,"9. No se sabe"]
[]
[null,null,"Otro motivo:\n(especifique)",null,null,null,null,null,null,null,null,null,null,null,null,null,null,null,null,null,null,null,null,null,null,null,null,null,null,null,null,null,{"$f":"IF(UPPER(C520=\"X\"),COUNTBLANK(G523),0)","v":0}]
[]
[null,null,"En caso de tener algún comentario u observación al dato registrado en la respuesta de la presente pregunta, o de los datos que derivan de la misma, favor de anotarlo en el siguiente espacio. De lo contrario, déjelo en blanco."]
[]
[]
[]
[]
[]
[]
[]
["2.48.-","Seleccione los medios por los cuales se inició la reposición de asientos o inscripciones registrales durante el año 2025.",null,null,null,null,null,null,null,null,null,null,null,null,null,null,null,null,null,null,null,null,null,null,null,null,null,null,null,null,null,null,{"$f":"IF(UPPER(C500)=\"X\",IF(COUNTBLANK(C538:C542)=5,1,0), 0)","v":0}]
[null,null,"Puede seleccionar con \"X\" más de un código."]
[null,null,"Si marca el numeral 4, anote el otro medio en el recuadro que está al final de la lista."]
[null,null,"Si elige el numeral 9, no marque otro código."]
[]
[null,null,null,"1. De oficio"]
[null,null,null,"2. A petición de parte"]
[null,null,null,"3. Por orden judicial o administrativa"]
[null,null,null,"4. Otro (especifique)"]
[null,null,null,"9. No se sabe"]
[]
[null,null,"Otro medio:\n(especifique)",null,null,null,null,null,null,null,null,null,null,null,null,null,null,null,null,null,null,null,null,null,null,null,null,null,null,null,null,null,{"$f":"IF(UPPER(C541=\"X\"),COUNTBLANK(G544),0)","v":0}]
[]
[null,null,"En caso de tener algún comentario u observación al dato registrado en la respuesta de la presente pregunta, o de los datos que derivan de la misma, favor de anotarlo en el siguiente espacio. De lo contrario, déjelo en blanco."]
[]
[]
[]
[]
[]
[]
[]
["2.49.-","Indique si en la institución registral de la entidad federativa se realizó la cancelación de asientos o inscripciones registrales durante el año 2025.",null,null,null,null,null,null,null,null,null,null,null,null,null,null,null,null,null,null,null,null,null,null,null,null,null,null,null,null,null,null,{"$f":"IF(AG17=\"\",IF(COUNTBLANK(C557)+COUNTBLANK(I557)+COUNTBLANK(T557)=3,1,0),0)","v":0}]
[null,null,"Seleccione con \"X\" un solo código."]
[]
[null,null,null,"1. Sí",null,null,null,null,null,"2. No (pase a la pregunta 2.52)",null,null,null,null,null,null,null,null,null,null,"9. No se sabe (pase a la pregunta 2.52)"]
[]
[null,null,"En caso de tener algún comentario u observación al dato registrado en la respuesta de la presente pregunta, o de los datos que derivan de la misma, favor de anotarlo en el siguiente espacio. De lo contrario, déjelo en blanco."]
[]
[]
[]
[]
[]
[]
[]
["2.50.-","Seleccione los medios por los cuales se inició la cancelación de asientos o inscripciones registrales durante el año 2025.",null,null,null,null,null,null,null,null,null,null,null,null,null,null,null,null,null,null,null,null,null,null,null,null,null,null,null,null,null,null,{"$f":"IF(UPPER(C557)=\"X\",IF(COUNTBLANK(C572:C578)=7,1,0), 0)","v":0}]
[null,null,"Puede seleccionar con \"X\" más de un código."]
[null,null,"Si marca el numeral 6, anote el otro medio en el recuadro que está al final de la lista."]
[null,null,"Si elige el numeral 9, no marque otro código."]
[]
[null,null,null,"1. Por consentimiento de las personas a cuyo favor estén hechas, mediante escritura pública"]
[null,null,null,"2. A petición de parte, por extinción del acto o derecho inscrito"]
[null,null,null,"3. Por orden judicial o administrativa"]
[null,null,null,"4. Por cumplimiento del plazo o el fallecimiento del titular, tratándose de derechos temporales o vitalicios"]
[null,null,null,"5. Por caducidad"]
[null,null,null,"6. Otro (especifique)"]
[null,null,null,"9. No se sabe"]
[]
[null,null,"Otro medio:\n(especifique)",null,null,null,null,null,null,null,null,null,null,null,null,null,null,null,null,null,null,null,null,null,null,null,null,null,null,null,null,null,{"$f":"IF(UPPER(C577=\"X\"),COUNTBLANK(G580),0)","v":0}]
[]
[null,null,"En caso de tener algún comentario u observación al dato registrado en la respuesta de la presente pregunta, o de los datos que derivan de la misma, favor de anotarlo en el siguiente espacio. De lo contrario, déjelo en blanco."]
[]
[]
[]
[]
[]
[]
[]
["2.51.-","Seleccione los tipos de cancelaciones que se realizaron en la institución registral de la entidad federativa durante el año 2025.",null,null,null,null,null,null,null,null,null,null,null,null,null,null,null,null,null,null,null,null,null,null,null,null,null,null,null,null,null,null,{"$f":"IF(UPPER(C557)=\"X\",IF(COUNTBLANK(C594:C596)=3,1,0), 0)","v":0}]
[null,null,"Puede seleccionar con \"X\" más de un código."]
[null,null,"Si elige el numeral 9, no marque otro código."]
[]
[null,null,null,"1. Parcial"]
[null,null,null,"2. Total"]
[null,null,null,"9. No se sabe"]
[]
[null,null,"En caso de tener algún comentario u observación al dato registrado en la respuesta de la presente pregunta, o de los datos que derivan de la misma, favor de anotarlo en el siguiente espacio. De lo contrario, déjelo en blanco."]

{"sheet":"CNGE_2026_M6_Secc2_Sub5","index":8,"n_rows":148,"n_cols":38,"rows_kept":148,"cut":false,"hidden":true,"merged":[[147,2,147,29],[148,2,148,29],[138,2,138,29],[140,3,140,29],[141,3,141,29],[142,3,142,29],[143,3,143,29],[145,2,145,5],[145,6,145,29],[137,2,137,29],[110,3,110,29],[111,3,111,29],[113,2,113,5],[113,6,113,29],[115,2,115,29],[116,2,116,29],[123,1,123,29],[124,2,124,29],[128,2,128,29],[129,2,129,29],[136,1,136,29],[109,3,109,29],[91,2,91,29],[98,1,98,29],[99,2,99,29],[100,2,100,29],[101,2,101,29],[103,3,103,29],[104,3,104,29],[105,3,105,29],[106,3,106,29],[107,3,107,29],[108,3,108,29],[90,2,90,29],[77,2,77,29],[79,3,79,29],[80,3,80,29],[81,3,81,29],[82,3,82,29],[83,3,83,29],[84,3,84,29],[85,3,85,29],[86,3,86,29],[88,2,88,5],[88,6,88,29],[76,2,76,29],[49,3,49,29],[51,2,51,5],[51,6,51,29],[53,2,53,29],[54,2,54,29],[61,1,61,29],[62,2,62,29],[66,2,66,29],[67,2,67,29],[74,1,74,29],[75,2,75,29],[48,3,48,29],[37,2,37,29],[38,2,38,29],[39,2,39,29],[40,2,40,29],[42,3,42,14],[42,15,42,16],[43,3,43,29],[44,3,44,29],[45,3,45,29],[46,3,46,29],[47,3,47,29],[36,1,36,29],[15,2,15,29],[16,2,16,29],[17,2,17,29],[18,2,18,29],[19,2,19,29],[20,1,20,29],[21,2,21,29],[23,1,23,29],[24,2,24,29],[28,2,28,29],[29,2,29,29],[14,2,14,29],[0,1,0,29],[2,1,2,29],[4,1,4,29],[6,26,6,29],[7,1,7,11],[7,13,7,14],[9,1,9,29],[10,1,10,29],[11,2,11,29],[12,2,12,29],[13,2,13,29]]}
[null,"CENSO NACIONAL DE GOBIERNOS\nESTATALES 2026",null,null,null,null,null,null,null,null,null,null,null,null,null,null,null,null,null,null,null,null,null,null,null,null,null,null,null,null,null,null,{"$f":"IF(SUM(AG10)>0,1,0)","v":0},{"$f":"IF(SUM(AL55)>0,1,0)","v":0}]
[]
[null,"Módulo 6.\nCatastro, registro y territorio"]
[]
[null,"Sección II. Registro Público de la Propiedad"]
[]
[null,"Entidad:",null,null,null,null,null,null,null,null,null,null,null,"Clave:",null,null,null,null,null,null,null,null,null,null,null,null,"Índice"]
[null,{"$f":"IF(Índice!B9=\"\",\"\",Índice!B9)","v":""},null,null,null,null,null,null,null,null,null,null,null,{"$f":"IF(Índice!N9=\"\",\"\",Índice!N9)","v":""}]
[]
[null,"II.5 Conservación y consulta del acervo documental",null,null,null,null,null,null,null,null,null,null,null,null,null,null,null,null,null,null,null,null,null,null,null,null,null,null,null,null,null,null,{"$f":"IF(SUM(AG24,AG37,AH37,AG52,AG62,AG75,AG89,AG99,AG114,AG124,AG137,AG146)=0,0,1)","v":0}]
[null,"Instrucciones generales para las preguntas de la subsección:",null,null,null,null,null,null,null,null,null,null,null,null,null,null,null,null,null,null,null,null,null,null,null,null,null,null,null,null,null,null,"Aux"]
[null,null,"1.- Periodo de referencia de los datos: \nAl cierre del año: la información se refiere a lo existente al 31 de diciembre de 2025.\nDurante el año: la información se refiere a lo existente del 1 de enero al 31 de diciembre de 2025.",null,null,null,null,null,null,null,null,null,null,null,null,null,null,null,null,null,null,null,null,null,null,null,null,null,null,null,null,null,{"$f":"IF(Índice!B9<>\"\",\"X\",\"\")","v":""}]
[null,null,"2.- Los catálogos utilizados en el presente cuestionario corresponden a denominaciones estándar, de tal forma que si el nombre de alguna clasificación no coincide exactamente con la utilizada en su entidad federativa, debe registrar los datos en aquella que sea homóloga. "]
[null,null,"3.- En caso de que los registros con los que cuente no le permitan desglosar la información de acuerdo con los requerimientos solicitados, anote \"NS\" (No se sabe) en las celdas donde no disponga de información. En el recuadro para comentarios de cada pregunta debe proporcionar una justificación respecto del uso del \"NS\" en determinado reactivo."]
[null,null,"4.- Las cifras deben anotarse con números enteros y sin espacio de separación ni comas, independientemente de si son miles o millones. En el caso de los porcentajes, estos además deben de ir sin el símbolo %."]
[null,null,"5.- No deje celdas en blanco, salvo en los casos en que la instrucción así lo solicite. ",null,null,null,null,null,null,null,null,null,null,null,null,null,null,null,null,null,null,null,null,null,null,null,null,null,null,null,null,null,"Aux"]
[null,null,"6.- En el caso de las tablas, deben estar contestadas todas las celdas, ya sea anotando \"0\" (cero), en caso de datos numéricos, o eligiendo algún código según el formato de respuesta.",null,null,null,null,null,null,null,null,null,null,null,null,null,null,null,null,null,null,null,null,null,null,null,null,null,null,null,null,null,{"$f":"IF(Índice!B9=\"\",\"X\",\"\")","v":"X"}]
[null,null,"7.- En las preguntas con listas desplegables, seleccione la opción que corresponda a la realidad de la entidad federativa."]
[null,null,"8.- Antes de concluir el cuestionario, revise que no haya celdas rellenas con color rojo, pues dicho color indica que hay error en la información y debe de corregirse. También asegúrese de que no haya celdas con color amarillo, ya que eso significa que falta una respuesta y debe proporcionarse la información.\t"]
[null,null,"9.- ¡Importante!: recuerde que todos los datos proporcionados en el cuestionario deben corresponder a los asentados en sus registros administrativos."]
[null,"Glosario de la subsección:"]
[null,null,"1.- Información existente en la institución registral: Se refiere a los asientos, inscripciones, libros, legajos, folios reales físicos o electrónicos, y en general, todos aquellos elementos que conforman el acervo documental de la institución registral."]
[]
["2.52.-","Indique si la institución registral de la entidad federativa realizó actividades para la conservación del acervo documental durante el año 2025.",null,null,null,null,null,null,null,null,null,null,null,null,null,null,null,null,null,null,null,null,null,null,null,null,null,null,null,null,null,null,{"$f":"IF(AG17=\"\",IF(COUNTBLANK(C27)+COUNTBLANK(I27)+COUNTBLANK(T27)=3,1,0),0)","v":0}]
[null,null,"Seleccione con \"X\" un solo código."]
[]
[null,null,null,"1. Sí",null,null,null,null,null,"2. No (pase a la pregunta 2.54)",null,null,null,null,null,null,null,null,null,null,"9. No se sabe (pase a la pregunta 2.54)"]
[]
[null,null,"En caso de tener algún comentario u observación al dato registrado en la respuesta de la presente pregunta, o de los datos que derivan de la misma, favor de anotarlo en el siguiente espacio. De lo contrario, déjelo en blanco."]
[null,null,null,null,null,null,null,null,null,null,null,null,null,null,null,null,null,null,null,null,null,null,null,null,null,null,null,null,null,null,null,null,null,null,null,null,0]
[]
[]
[]
[]
[]
[]
["2.53.-","Seleccione los procedimientos que fueron utilizados para la conservación del acervo documental durante el año 2025.",null,null,null,null,null,null,null,null,null,null,null,null,null,null,null,null,null,null,null,null,null,null,null,null,null,null,null,null,null,null,{"$f":"IF(UPPER(C27)=\"X\",IF(COUNTBLANK(C43:C50)=8,1,0), 0)","v":0},{"$f":"IF(UPPER(C43=\"X\"),COUNTBLANK(P43),0)","v":0}]
[null,null,"Puede seleccionar con \"X\" más de un código."]
[null,null,"Si selecciona el numeral \"1. Digitalización de archivos\", anote el porcentaje de archivos digitalizados al cierre del año 2025 en la institución registral de la entidad federativa. La cifra debe estar escrita con números enteros sin el símbolo de porcentaje (%)."]
[null,null,"Si marca el numeral 7, anote el otro procedimiento en el recuadro que está al final de la lista."]
[null,null,"Si elige el numeral 9, no marque otro código."]
[]
[null,null,null,"1. Digitalización de archivos",null,null,null,null,null,null,null,null,null,null,null,null,null,"%"]
[null,null,null,"2. Captura de libros y legajos"]
[null,null,null,"3. Indexación"]
[null,null,null,"4. Verificación del tracto registral"]
[null,null,null,"5. Conversión y migración de la información registral"]
[null,null,null,"6. Encuadernación y/ o restauración de libros"]
[null,null,null,"7. Otro (especifique)"]
[null,null,null,"9. No se sabe"]
[]
[null,null,"Otro procedimiento:\n(especifique)",null,null,null,null,null,null,null,null,null,null,null,null,null,null,null,null,null,null,null,null,null,null,null,null,null,null,null,null,null,{"$f":"IF(UPPER(C49=\"X\"),COUNTBLANK(G52),0)","v":0}]
[]
[null,null,"En caso de tener algún comentario u observación al dato registrado en la respuesta de la presente pregunta, o de los datos que derivan de la misma, favor de anotarlo en el siguiente espacio. De lo contrario, déjelo en blanco."]
[null,null,null,null,null,null,null,null,null,null,null,null,null,null,null,null,null,null,null,null,null,null,null,null,null,null,null,null,null,null,null,null,null,null,null,null,0,{"$f":"IF(AK55=1,COUNTBLANK(C55),0)","v":0}]
[]
[]
[]
[]
[]
[]
["2.54.-","Indique si la institución registral de la entidad federativa tuvo un espacio físico acondicionado para la conservación del acervo documental durante el año 2025.",null,null,null,null,null,null,null,null,null,null,null,null,null,null,null,null,null,null,null,null,null,null,null,null,null,null,null,null,null,null,{"$f":"IF(AG17=\"\",IF(COUNTBLANK(C65)+COUNTBLANK(I65)+COUNTBLANK(T65)=3,1,0),0)","v":0}]
[null,null,"Seleccione con \"X\" un solo código."]
[]
[null,null,null,"1. Sí",null,null,null,null,null,"2. No ",null,null,null,null,null,null,null,null,null,null,"9. No se sabe "]
[]
[null,null,"En caso de tener algún comentario u observación al dato registrado en la respuesta de la presente pregunta, o de los datos que derivan de la misma, favor de anotarlo en el siguiente espacio. De lo contrario, déjelo en blanco."]
[]
[]
[]
[]
[]
[]
[]
["2.55.-","Seleccione las medidas de seguridad que existieron para el resguardo del acervo documental en la oficina estatal o central durante el año 2025. ",null,null,null,null,null,null,null,null,null,null,null,null,null,null,null,null,null,null,null,null,null,null,null,null,null,null,null,null,null,null,{"$f":"IF(AG17=\"\",IF(COUNTBLANK(C80:C87)=8,1,0),0)","v":0}]
[null,null,"Puede seleccionar con \"X\" más de un código."]
[null,null,"Si marca el numeral 6, anote la otra medida de seguridad en el recuadro que está al final de la lista."]
[null,null,"Si elige el numeral 7 o el 9, no marque otro código."]
[]
[null,"",null,"1. Área cerrada"]
[null,null,null,"2. Cámaras de seguridad"]
[null,null,null,"3. Códigos de acceso"]
[null,null,null,"4. Registro de préstamo de libros y/ o legajos (en papel)"]
[null,"",null,"5. Personal encargado"]
[null,null,null,"6. Otra (especifique)"]
[null,null,null,"7. No existían medidas de seguridad para el resguardo del acervo"]
[null,"",null,"9. No se sabe"]
[]
[null,null,"Otra medida de seguridad:\n(especifique)",null,null,null,null,null,null,null,null,null,null,null,null,null,null,null,null,null,null,null,null,null,null,null,null,null,null,null,null,null,{"$f":"IF(UPPER(C85=\"X\"),COUNTBLANK(G89),0)","v":0}]
[]
[null,null,"En caso de tener algún comentario u observación al dato registrado en la respuesta de la presente pregunta, o de los datos que derivan de la misma, favor de anotarlo en el siguiente espacio. De lo contrario, déjelo en blanco."]
[]
[]
[]
[]
[]
[]
[]
["2.56.-","Seleccione los riesgos para los cuales se establecieron medidas preventivas para el resguardo del acervo en la oficina estatal o central durante el año 2025.",null,null,null,null,null,null,null,null,null,null,null,null,null,null,null,null,null,null,null,null,null,null,null,null,null,null,null,null,null,null,{"$f":"IF(AG17=\"\",IF(COUNTBLANK(C104:C112)=9,1,0),0)","v":0}]
[null,null,"Puede seleccionar con \"X\" más de un código."]
[null,null,"Si marca el numeral 7, anote el otro tipo de riesgo para el que se establecieron medidas preventivas en el recuadro que está al final de la lista."]
[null,null,"Si elige el numeral 8 o el 9, no marque otro código."]
[]
[null,null,null,"1. Deterioro"]
[null,null,null,"2. Humedad"]
[null,null,null,"3. Incendio"]
[null,null,null,"4. Plagas"]
[null,null,null,"5. Robo"]
[null,null,null,"6. Vandalismo"]
[null,null,null,"7. Otro (especifique)"]
[null,null,null,"8. Ninguno"]
[null,null,null,"9. No se sabe"]
[]
[null,null,"Otro tipo de riesgo:\n(especifique)",null,null,null,null,null,null,null,null,null,null,null,null,null,null,null,null,null,null,null,null,null,null,null,null,null,null,null,null,null,{"$f":"IF(UPPER(C110=\"X\"),COUNTBLANK(G114),0)","v":0}]
[]
[null,null,"En caso de tener algún comentario u observación al dato registrado en la respuesta de la presente pregunta, o de los datos que derivan de la misma, favor de anotarlo en el siguiente espacio. De lo contrario, déjelo en blanco."]
[]
[]
[]
[]
[]
[]
[]
["2.57.-","Indique si durante el año 2025 el público pudo consultar la información existente en la institución registral de la entidad federativa.",null,null,null,null,null,null,null,null,null,null,null,null,null,null,null,null,null,null,null,null,null,null,null,null,null,null,null,null,null,null,{"$f":"IF(AG17=\"\",IF(COUNTBLANK(C127)+COUNTBLANK(I127)+COUNTBLANK(T127)=3,1,0),0)","v":0}]
[null,null,"Seleccione con \"X\" un solo código."]
[]
[null,null,null,"1. Sí",null,null,null,null,null,"2. No (pase a la pregunta 2.59)",null,null,null,null,null,null,null,null,null,null,"9. No se sabe (pase a la pregunta 2.59)"]
[]
[null,null,"En caso de tener algún comentario u observación al dato registrado en la respuesta de la presente pregunta, o de los datos que derivan de la misma, favor de anotarlo en el siguiente espacio. De lo contrario, déjelo en blanco."]
[null,null,null,null,null,null,null,null,null,null,null,null,null,null,null,null,null,null,null,null,null,null,null,null,null,null,null,null,null,null,null,null,null,null,null,null,0]
[]
[]
[]
[]
[]
[]
["2.58.-","Seleccione los métodos por los que el público pudo consultar la información existente en la institución registral durante el año 2025.",null,null,null,null,null,null,null,null,null,null,null,null,null,null,null,null,null,null,null,null,null,null,null,null,null,null,null,null,null,null,{"$f":"IF(UPPER(C127)=\"X\",IF(COUNTBLANK(C141:C144)=4,1,0), 0)","v":0}]
[null,null,"Puede seleccionar con \"X\" más de un código."]
[null,null,"Si marca el numeral 4, anote el otro método de consulta en el recuadro que está al final de la lista."]
[]
[null,null,null,"1. En forma física"]
[null,null,null,"2. En forma digital en las oficinas de la institución registral"]
[null,null,null,"3. En forma digital en la página de Internet de la institución registral"]
[null,null,null,"4. Otro (especifique)"]
[]
[null,null,"Otro método de consulta:\n(especifique)",null,null,null,null,null,null,null,null,null,null,null,null,null,null,null,null,null,null,null,null,null,null,null,null,null,null,null,null,null,{"$f":"IF(UPPER(C144=\"X\"),COUNTBLANK(G146),0)","v":0}]
[]
[null,null,"En caso de tener algún comentario u observación al dato registrado en la respuesta de la presente pregunta, o de los datos que derivan de la misma, favor de anotarlo en el siguiente espacio. De lo contrario, déjelo en blanco."]

{"sheet":"CNGE_2026_M6_Secc2_Sub6","index":9,"n_rows":279,"n_cols":38,"rows_kept":279,"cut":false,"hidden":true,"merged":[[274,3,274,29],[275,3,275,29],[276,3,276,29],[278,2,278,29],[279,2,279,29],[268,3,268,29],[269,3,269,29],[270,3,270,29],[271,3,271,29],[272,3,272,29],[273,3,273,29],[255,2,255,29],[256,2,256,29],[263,1,263,29],[264,2,264,29],[265,2,265,29],[267,3,267,29],[248,3,248,29],[249,3,249,29],[250,3,250,29],[251,3,251,29],[252,3,252,29],[253,3,253,29],[242,3,242,29],[243,3,243,29],[244,3,244,29],[245,3,245,29],[246,3,246,29],[247,3,247,29],[229,2,229,29],[236,1,236,29],[237,2,237,29],[238,2,238,29],[240,3,240,29],[241,3,241,29],[224,3,224,15],[224,16,224,22],[224,23,224,29],[226,2,226,5],[226,6,226,29],[228,2,228,29],[222,2,222,3],[222,4,222,15],[222,16,222,22],[222,23,222,29],[223,2,223,3],[223,4,223,15],[223,16,223,22],[223,23,223,29],[220,3,220,15],[220,16,220,22],[220,23,220,29],[221,2,221,3],[221,4,221,15],[221,16,221,22],[221,23,221,29],[218,3,218,15],[218,16,218,22],[218,23,218,29],[219,3,219,15],[219,16,219,22],[219,23,219,29],[215,2,216,15],[215,16,215,29],[216,16,216,22],[216,23,216,29],[217,3,217,15],[217,16,217,22],[217,23,217,29],[199,1,199,29],[200,2,200,29],[204,2,204,29],[205,2,205,29],[212,1,212,29],[213,2,213,29],[186,3,186,29],[187,3,187,29],[189,2,189,5],[189,6,189,29],[191,2,191,29],[192,2,192,29],[180,3,180,29],[181,3,181,29],[182,3,182,29],[183,3,183,29],[184,3,184,29],[185,3,185,29],[173,1,173,29],[174,2,174,29],[175,2,175,29],[176,2,176,29],[178,3,178,29],[179,3,179,29],[161,3,161,24],[161,25,161,29],[163,2,163,5],[163,6,163,29],[165,2,165,29],[166,2,166,29],[158,3,158,24],[158,25,158,29],[159,3,159,24],[159,25,159,29],[160,3,160,24],[160,25,160,29],[153,1,153,29],[154,2,154,29],[156,2,156,24],[156,25,156,29],[157,3,157,24],[157,25,157,29],[140,3,140,29],[141,3,141,29],[143,2,143,5],[143,6,143,29],[145,2,145,29],[146,2,146,29],[134,3,134,29],[135,3,135,29],[136,3,136,29],[137,3,137,29],[138,3,138,29],[139,3,139,29],[127,1,127,29],[128,2,128,29],[129,2,129,29],[130,2,130,29],[132,3,132,29],[133,3,133,29],[106,2,106,29],[107,2,107,29],[114,1,114,29],[115,2,115,29],[119,2,119,29],[120,2,120,29],[101,2,101,3],[101,4,101,19],[101,20,101,29],[102,3,102,19],[102,20,102,29],[104,2,104,5],[104,6,104,29],[98,3,98,19],[98,20,98,29],[99,3,99,19],[99,20,99,29],[100,2,100,3],[100,4,100,19],[100,20,100,29],[96,2,96,3],[96,4,96,19],[96,20,96,29],[97,2,97,3],[97,4,97,19],[97,20,97,29],[94,2,94,3],[94,4,94,19],[94,20,94,29],[95,2,95,3],[95,4,95,19],[95,20,95,29],[91,2,91,3],[91,4,91,19],[91,20,91,29],[92,3,92,19],[92,20,92,29],[93,3,93,19],[93,20,93,29],[89,2,89,3],[89,4,89,19],[89,20,89,29],[90,2,90,3],[90,4,90,19],[90,20,90,29],[86,3,86,19],[86,20,86,29],[87,2,87,3],[87,4,87,19],[87,20,87,29],[88,2,88,3],[88,4,88,19],[88,20,88,29],[84,2,84,3],[84,4,84,19],[84,20,84,29],[85,2,85,3],[85,4,85,19],[85,20,85,29],[79,1,79,29],[80,2,80,29],[82,2,82,19],[82,20,82,29],[83,3,83,19],[83,20,83,29],[58,2,58,29],[59,2,59,29],[66,1,66,29],[67,2,67,29],[71,2,71,29],[72,2,72,29],[50,3,50,29],[51,3,51,29],[52,3,52,29],[53,3,53,29],[54,3,54,29],[56,2,56,5],[56,6,56,29],[44,3,44,29],[45,3,45,29],[46,3,46,29],[47,3,47,29],[48,3,48,29],[49,3,49,29],[31,2,31,29],[32,2,32,29],[39,1,39,29],[40,2,40,29],[41,2,41,29],[42,2,42,29],[21,2,21,29],[22,2,22,29],[23,2,23,29],[24,2,24,29],[26,1,26,29],[27,2,27,29],[18,2,18,29],[19,2,19,29],[20,1,20,29],[9,1,9,29],[10,1,10,29],[11,2,11,29],[12,2,12,29],[13,2,13,29],[14,2,14,29],[0,1,0,29],[2,1,2,29],[4,1,4,29],[6,26,6,29],[7,1,7,11],[7,13,7,14],[15,2,15,29],[16,2,16,29],[17,2,17,29]]}
[null,"CENSO NACIONAL DE GOBIERNOS\nESTATALES 2026",null,null,null,null,null,null,null,null,null,null,null,null,null,null,null,null,null,null,null,null,null,null,null,null,null,null,null,null,null,null,{"$f":"IF(SUM(AG10)>0,1,0)","v":0},{"$f":"IF(SUM(AL33)>0,1,0)","v":0}]
[]
[null,"Módulo 6.\nCatastro, registro y territorio"]
[]
[null,"Sección II. Registro Público de la Propiedad"]
[]
[null,"Entidad:",null,null,null,null,null,null,null,null,null,null,null,"Clave:",null,null,null,null,null,null,null,null,null,null,null,null,"Índice"]
[null,{"$f":"IF(Índice!B9=\"\",\"\",Índice!B9)","v":""},null,null,null,null,null,null,null,null,null,null,null,{"$f":"IF(Índice!N9=\"\",\"\",Índice!N9)","v":""}]
[]
[null,"II.6 Tecnologías de la información",null,null,null,null,null,null,null,null,null,null,null,null,null,null,null,null,null,null,null,null,null,null,null,null,null,null,null,null,null,null,{"$f":"IF(SUM(AG27,AG40,AG57,AG67,AG80,AG105,AG115,AG128,AG144,AG154,AG164,AG174,AG190,AG200,AG213,AG227,AG237,AG264)=0,0,1)","v":0}]
[null,"Instrucciones generales para las preguntas de la subsección:",null,null,null,null,null,null,null,null,null,null,null,null,null,null,null,null,null,null,null,null,null,null,null,null,null,null,null,null,null,null,"Aux"]
[null,null,"1.- Periodo de referencia de los datos: \nAl cierre del año: la información se refiere a lo existente al 31 de diciembre de 2025.\nDurante el año: la información se refiere a lo existente del 1 de enero al 31 de diciembre de 2025.",null,null,null,null,null,null,null,null,null,null,null,null,null,null,null,null,null,null,null,null,null,null,null,null,null,null,null,null,null,{"$f":"IF(Índice!B9<>\"\",\"X\",\"\")","v":""}]
[null,null,"2.- Los catálogos utilizados en el presente cuestionario corresponden a denominaciones estándar, de tal forma que si el nombre de alguna clasificación no coincide exactamente con la utilizada en su entidad federativa, debe registrar los datos en aquella que sea homóloga. "]
[null,null,"3.- En caso de que los registros con los que cuente no le permitan desglosar la información de acuerdo con los requerimientos solicitados, anote \"NS\" (No se sabe) en las celdas donde no disponga de información. En el recuadro para comentarios de cada pregunta debe proporcionar una justificación respecto del uso del \"NS\" en determinado reactivo."]
[null,null,"4.- Las cifras deben anotarse con números enteros y sin espacio de separación ni comas, independientemente de si son miles o millones. En el caso de los porcentajes, estos además deben de ir sin el símbolo %."]
[null,null,"5.- No deje celdas en blanco, salvo en los casos en que la instrucción así lo solicite. ",null,null,null,null,null,null,null,null,null,null,null,null,null,null,null,null,null,null,null,null,null,null,null,null,null,null,null,null,null,"Aux"]
[null,null,"6.- En el caso de las tablas, deben estar contestadas todas las celdas, ya sea anotando \"0\" (cero), en caso de datos numéricos, o eligiendo algún código según el formato de respuesta.",null,null,null,null,null,null,null,null,null,null,null,null,null,null,null,null,null,null,null,null,null,null,null,null,null,null,null,null,null,{"$f":"IF(Índice!B9=\"\",\"X\",\"\")","v":"X"}]
[null,null,"7.- En las preguntas con listas desplegables, seleccione la opción que corresponda a la realidad de la entidad federativa."]
[null,null,"8.- Antes de concluir el cuestionario, revise que no haya celdas rellenas con color rojo, pues dicho color indica que hay error en la información y debe de corregirse. También asegúrese de que no haya celdas con color amarillo, ya que eso significa que falta una respuesta y debe proporcionarse la información.\t"]
[null,null,"9.- ¡Importante!: recuerde que todos los datos proporcionados en el cuestionario deben corresponder a los asentados en sus registros administrativos."]
[null,"Glosario de la subsección:"]
[null,null,"1.- Grandes usuarios: se refiere a aquellos que realizan trámites registrales de forma masiva, tales como notarios, INFONAVIT, FOVISSSTE, SHF, entre otros."]
[null,null,"2.- Otras instituciones: se refiere a aquellas que tienen relación con la actividad registral, tales como catastro, RAN, INDAABIN, entre otros."]
[null,null,"3.- Indicadores de operación: se refiere a aquellos que se generan para conocer las operaciones que realizan las instituciones registrales en su gestión."]
[null,null,"4.- Indicadores de servicios: se refiere a aquellos que se generan para medir la calidad en el servicio, por lo que reflejan la eficiencia y calidad de los servicios que se prestan en la institución registral."]
[]
["2.59.-","Indique si la institución registral de la entidad federativa tuvo un sistema de gestión registral durante el año 2025.",null,null,null,null,null,null,null,null,null,null,null,null,null,null,null,null,null,null,null,null,null,null,null,null,null,null,null,null,null,null,{"$f":"IF(AG12=\"X\",IF(COUNTBLANK(C30)+COUNTBLANK(I30)+COUNTBLANK(T30)=3,1,0),0)","v":0}]
[null,null,"Seleccione con \"X\" un solo código."]
[]
[null,null,null,"1. Sí",null,null,null,null,null,"2. No (pase a la pregunta 2.61)",null,null,null,null,null,null,null,null,null,null,"9. No se sabe (pase a la pregunta 2.61)"]
[]
[null,null,"En caso de tener algún comentario u observación al dato registrado en la respuesta de la presente pregunta, o de los datos que derivan de la misma, favor de anotarlo en el siguiente espacio. De lo contrario, déjelo en blanco."]
[null,null,null,null,null,null,null,null,null,null,null,null,null,null,null,null,null,null,null,null,null,null,null,null,null,null,null,null,null,null,null,null,null,null,null,null,0,{"$f":"IF(AK33=1,COUNTBLANK(C33),0)","v":0}]
[]
[]
[]
[]
[]
[]
["2.60.-","Seleccione los elementos incorporados en el sistema de gestión registral empleado por la institución registral de la entidad federativa durante el año 2025.",null,null,null,null,null,null,null,null,null,null,null,null,null,null,null,null,null,null,null,null,null,null,null,null,null,null,null,null,null,null,{"$f":"IF(UPPER(C30)=\"X\",IF(COUNTBLANK(C45:C55)=11,1,0), 0)","v":0}]
[null,null,"Puede seleccionar con \"X\" más de un código."]
[null,null,"Si marca el numeral 10, anote el otro elemento en el recuadro que está al final de la lista."]
[null,null,"Si elige el numeral 99, no marque otro código."]
[]
[null,null,null,"1. Proceso de inscripción "]
[null,null,null,"2. Proceso de conservación del acervo"]
[null,null,null,"3. Proceso de certificación"]
[null,null,null,"4. Proceso de consulta "]
[null,null,null,"5. Validación de pagos"]
[null,null,null,"6. Firma electrónica"]
[null,null,null,"7. Interfaces con grandes usuarios "]
[null,null,null,"8. Interfaces con otras instituciones "]
[null,null,null,"9. Interfaz para el público en general"]
[null,null,null,"10. Otro (especifique)"]
[null,null,null,"99. No se sabe"]
[]
[null,null,"Otro elemento:\n(especifique)",null,null,null,null,null,null,null,null,null,null,null,null,null,null,null,null,null,null,null,null,null,null,null,null,null,null,null,null,null,{"$f":"IF(UPPER(C54=\"X\"),COUNTBLANK(G57),0)","v":0}]
[]
[null,null,"En caso de tener algún comentario u observación al dato registrado en la respuesta de la presente pregunta, o de los datos que derivan de la misma, favor de anotarlo en el siguiente espacio. De lo contrario, déjelo en blanco."]
[]
[]
[]
[]
[]
[]
[]
["2.61.-","Indique si durante el año 2025 la institución registral generó estadísticas de operación.",null,null,null,null,null,null,null,null,null,null,null,null,null,null,null,null,null,null,null,null,null,null,null,null,null,null,null,null,null,null,{"$f":"IF(AG12=\"X\",IF(COUNTBLANK(C70)+COUNTBLANK(I70)+COUNTBLANK(T70)=3,1,0),0)","v":0}]
[null,null,"Seleccione con \"X\" un solo código."]
[]
[null,null,null,"1. Sí",null,null,null,null,null,"2. No (pase a la pregunta 2.63)",null,null,null,null,null,null,null,null,null,null,"9. No se sabe (pase a la pregunta 2.63)"]
[]
[null,null,"En caso de tener algún comentario u observación al dato registrado en la respuesta de la presente pregunta, o de los datos que derivan de la misma, favor de anotarlo en el siguiente espacio. De lo contrario, déjelo en blanco."]
[]
[]
[]
[]
[]
[]
[]
["2.62.-","Indique si durante el año 2025 la institución registral generó los siguientes tipos de reportes estadísticos de operación.",null,null,null,null,null,null,null,null,null,null,null,null,null,null,null,null,null,null,null,null,null,null,null,null,null,null,null,null,null,null,{"$f":"IF(UPPER(C70)=\"X\",IF(AND(U84=1,OR(U85=\"\",U86=\"\")),1,0)+IF(AND(U87=1,OR(U88=\"\",U89=\"\",U90=\"\",U91=\"\",U92=\"\")),1,0)+IF(AND(U94=1,OR(U95=\"\",U96=\"\",U97=\"\",U98=\"\")),1,0)+IF(AND(U100=1,OR(U101=\"\",U102=\"\")),1,0)+COUNTBLANK(U84)+COUNTBLANK(U87)+COUNTBLANK(U93)+COUNTBLANK(U94)+COUNTBLANK(U99)+COUNTBLANK(U100)+COUNTBLANK(U103),0)","v":0}]
[null,null,"Si responde \"1. Sí\" en el numeral 7, anote el otro tipo de reporte estadístico en el recuadro que está al final de la tabla."]
[]
[null,null,"Tipo de reporte",null,null,null,null,null,null,null,null,null,null,null,null,null,null,null,null,null,"¿Se generó este reporte?\n(1.Sí / 2.No / 9.No se sabe)"]
[null,null,"1.","Solicitudes nuevas"]
[null,null,"1.1",null,"Ingresadas por ventanilla física"]
[null,null,"1.2",null,"Ingresadas por ventanilla en línea"]
[null,null,"2.","Solicitudes resueltas"]
[null,null,"2.1",null,"Finalizadas"]
[null,null,"2.2",null,"Suspendidas"]
[null,null,"2.3",null,"Negadas"]
[null,null,"2.4",null,"Promedio de días por trámite"]
[null,null,"2.5",null,"Productividad"]
[null,null,"3.","Solicitudes pendientes"]
[null,null,"4.","Por cantidad de trámites"]
[null,null,"4.1",null,"Certificados"]
[null,null,"4.2",null,"Copias simples"]
[null,null,"4.3",null,"Copias certificadas"]
[null,null,"4.4",null,"Inscripciones"]
[null,null,"5.","Rectificaciones"]
[null,null,"6.","Operación"]
[null,null,"6.1",null,"Promedio, en días, para registrar una operación"]
[null,null,"6.2",null,"Días que tarda la expedición de certificados"]
[null,null,"7.","Otro (especifique)"]
[]
[null,null,"Otro tipo de reporte estadístico:\n(especifique)",null,null,null,null,null,null,null,null,null,null,null,null,null,null,null,null,null,null,null,null,null,null,null,null,null,null,null,null,null,{"$f":"IF(U103=1,COUNTBLANK(G105),0)","v":0}]
[]
[null,null,"En caso de tener algún comentario u observación al dato registrado en la respuesta de la presente pregunta, o de los datos que derivan de la misma, favor de anotarlo en el siguiente espacio. De lo contrario, déjelo en blanco."]
[]
[]
[]
[]
[]
[]
[]
["2.63.-","Indique si la institución registral de la entidad federativa tuvo una página de Internet durante el año 2025.",null,null,null,null,null,null,null,null,null,null,null,null,null,null,null,null,null,null,null,null,null,null,null,null,null,null,null,null,null,null,{"$f":"IF(AG12=\"X\",IF(COUNTBLANK(C118)+COUNTBLANK(I118)+COUNTBLANK(T118)=3,1,0),0)","v":0}]
[null,null,"Seleccione con \"X\" un solo código."]
[]
[null,null,null,"1. Sí",null,null,null,null,null,"2. No (pase a la pregunta 2.67)",null,null,null,null,null,null,null,null,null,null,"9. No se sabe (pase a la pregunta 2.67)"]
[]
[null,null,"En caso de tener algún comentario u observación al dato registrado en la respuesta de la presente pregunta, o de los datos que derivan de la misma, favor de anotarlo en el siguiente espacio. De lo contrario, déjelo en blanco."]
[]
[]
[]
[]
[]
[]
[]
["2.64.-","Seleccione las acciones que los usuarios pudieron realizar a través de la página de Internet de la institución registral de la entidad federativa durante el año 2025.",null,null,null,null,null,null,null,null,null,null,null,null,null,null,null,null,null,null,null,null,null,null,null,null,null,null,null,null,null,null,{"$f":"IF(UPPER(C118)=\"X\",IF(COUNTBLANK(C133:C142)=10,1,0), 0)","v":0}]
[null,null,"Puede seleccionar con \"X\" más de un código."]
[null,null,"Si marca el numeral 9, anote el otro tipo de acción en el recuadro que está al final de la lista."]
[null,null,"Si elige el numeral 99, no marque otro código."]
[]
[null,null,null,"1. Consulta de antecedentes registrales"]
[null,null,null,"2. Consulta de boletín registral"]
[null,null,null,"3. Consulta de estatus del trámite"]
[null,null,null,"4. Consulta de folio real electrónico "]
[null,null,null,"5. Consulta de información de la institución registral (dirección, horario, datos de contacto)"]
[null,null,null,"6. Consulta de requisitos de trámites y servicios"]
[null,null,null,"7. Realizar trámites de inscripción, gravámenes, certificados, copias certificadas, anotaciones preventivas y/ o marginales"]
[null,null,null,"8. Solicitud de citas "]
[null,null,null,"9. Otro (especifique)"]
[null,null,null,"99. No se sabe"]
[]
[null,null,"Otro tipo de acción:\n(especifique)",null,null,null,null,null,null,null,null,null,null,null,null,null,null,null,null,null,null,null,null,null,null,null,null,null,null,null,null,null,{"$f":"IF(UPPER(C141=\"X\"),COUNTBLANK(G144),0)","v":0}]
[]
[null,null,"En caso de tener algún comentario u observación al dato registrado en la respuesta de la presente pregunta, o de los datos que derivan de la misma, favor de anotarlo en el siguiente espacio. De lo contrario, déjelo en blanco."]
[]
[]
[]
[]
[]
[]
[]
["2.65.-","Indique si los siguientes tipos de portales existieron en la página de Internet de la institución registral de la entidad federativa durante el año 2025. ",null,null,null,null,null,null,null,null,null,null,null,null,null,null,null,null,null,null,null,null,null,null,null,null,null,null,null,null,null,null,{"$f":"IF(UPPER(C118)=\"X\",(IF(COUNTBLANK(Z158:Z162)>0,1,0)),0)","v":0}]
[null,null,"Si responde \"1. Sí\" en el numeral 5, anote el otro tipo de portal en el recuadro que está al final de la tabla."]
[]
[null,null,"Tipo de portal ",null,null,null,null,null,null,null,null,null,null,null,null,null,null,null,null,null,null,null,null,null,null,"¿Existió?\n(1.Sí / 2.No / 9.No se sabe)"]
[null,null,"1.","Portal de servicios a grandes usuarios"]
[null,null,"2.","Portal de servicios a otras instituciones "]
[null,null,"3.","Portal de servicios al público en general"]
[null,null,"4.","Intranet de la institución registral"]
[null,null,"5.","Otro (especifique)"]
[]
[null,null,"Otro tipo de portal:\n(especifique)",null,null,null,null,null,null,null,null,null,null,null,null,null,null,null,null,null,null,null,null,null,null,null,null,null,null,null,null,null,{"$f":"IF(Z162=1,COUNTBLANK(G164),0)","v":0}]
[]
[null,null,"En caso de tener algún comentario u observación al dato registrado en la respuesta de la presente pregunta, o de los datos que derivan de la misma, favor de anotarlo en el siguiente espacio. De lo contrario, déjelo en blanco."]
[]
[]
[]
[]
[]
[]
[]
["2.66.-","Si registró una respuesta afirmativa en el numeral \"1. Portal de servicios a grandes usuarios\" de la pregunta 2.65, seleccione las características del portal durante el año 2025. ",null,null,null,null,null,null,null,null,null,null,null,null,null,null,null,null,null,null,null,null,null,null,null,null,null,null,null,null,null,null,{"$f":"IF(AND(UPPER(C118)=\"X\",Z158=1),IF(COUNTBLANK(C179:C188)=10,1,0), 0)","v":0}]
[null,null,"Puede seleccionar con \"X\" más de un código."]
[null,null,"Si marca el numeral 9, anote la otra característica en el recuadro que está al final de la lista."]
[null,null,"Si elige el numeral 99, no marque otro código."]
[]
[null,null,null,"1. Servicios electrónicos de consulta"]
[null,null,null,"2. Consulta de estatus del trámite"]
[null,null,null,"3. Consulta de estatus del folio real electrónico"]
[null,null,null,"4. Trámites y servicios electrónicos"]
[null,null,null,"5. Recepción y precaptura de actos inmobiliarios"]
[null,null,null,"6. Motor de cálculo de derechos e impuestos relativos a la propiedad"]
[null,null,null,"7. Módulo de pago y/ o facturación"]
[null,null,null,"8. Cancelaciones"]
[null,null,null,"9. Otra (especifique)"]
[null,null,null,"99. No se sabe"]
[]
[null,null,"Otra característica:\n(especifique)",null,null,null,null,null,null,null,null,null,null,null,null,null,null,null,null,null,null,null,null,null,null,null,null,null,null,null,null,null,{"$f":"IF(UPPER(C187=\"X\"),COUNTBLANK(G190),0)","v":0}]
[]
[null,null,"En caso de tener algún comentario u observación al dato registrado en la respuesta de la presente pregunta, o de los datos que derivan de la misma, favor de anotarlo en el siguiente espacio. De lo contrario, déjelo en blanco."]
[]
[]
[]
[]
[]
[]
[]
["2.67.-","Indique si la institución registral de la entidad federativa brindó servicios electrónicos al público en general durante el año 2025.",null,null,null,null,null,null,null,null,null,null,null,null,null,null,null,null,null,null,null,null,null,null,null,null,null,null,null,null,null,null,{"$f":"IF(AG12=\"X\",IF(COUNTBLANK(C203)+COUNTBLANK(I203)+COUNTBLANK(T203)=3,1,0),0)","v":0}]
[null,null,"Seleccione con \"X\" un solo código."]
[]
[null,null,null,"1. Sí",null,null,null,null,null,"2. No (pase a la pregunta 2.69)",null,null,null,null,null,null,null,null,null,null,"9. No se sabe (pase a la pregunta 2.69)"]
[]
[null,null,"En caso de tener algún comentario u observación al dato registrado en la respuesta de la presente pregunta, o de los datos que derivan de la misma, favor de anotarlo en el siguiente espacio. De lo contrario, déjelo en blanco."]
[]
[]
[]
[]
[]
[]
[]
["2.68.-","Indique si durante el año 2025 la institución registral de la entidad federativa brindó los siguientes servicios electrónicos en las oficinas y/ o la página de Internet.",null,null,null,null,null,null,null,null,null,null,null,null,null,null,null,null,null,null,null,null,null,null,null,null,null,null,null,null,null,null,{"$f":"IF(UPPER(C203)=\"X\",IF(AND(Q221=1,OR(Q222=\"\",Q223=\"\",Q224=\"\")),1,0)+IF(AND(X221=1,OR(X222=\"\",X223=\"\",X224=\"\")),1,0)+COUNTBLANK(Q218:Q220)+COUNTBLANK(Q225)+COUNTBLANK(X218:X220)+COUNTBLANK(X225),0)","v":0}]
[null,null,"Si responde \"1. Sí\" en el numeral 5, anote el otro servicio electrónico en el recuadro que está al final de la tabla."]
[]
[null,null,"Servicios electrónicos",null,null,null,null,null,null,null,null,null,null,null,null,null,"¿Brindó el servicio? \n(1.Sí / 2.No / 9.No se sabe)"]
[null,null,null,null,null,null,null,null,null,null,null,null,null,null,null,null,"Oficinas de la institución registral",null,null,null,null,null,null,"Página de Internet de la institución registral"]
[null,null,"1.","Consulta de estatus del trámite"]
[null,null,"2.","Consulta de la información registral"]
[null,null,"3.","Consulta de inscripciones"]
[null,null,"4.","Trámites electrónicos"]
[null,null,"4.1",null,"Anotaciones marginales y/ o preventivas"]
[null,null,"4.2",null,"Inscripciones"]
[null,null,"4.3",null,"Certificados"]
[null,null,"5.","Otro (especifique)"]
[]
[null,null,"Otro servicio electrónico:\n(especifique)",null,null,null,null,null,null,null,null,null,null,null,null,null,null,null,null,null,null,null,null,null,null,null,null,null,null,null,null,null,{"$f":"IF(OR(Q225=1, X225=1),COUNTBLANK(G227),0)","v":0}]
[]
[null,null,"En caso de tener algún comentario u observación al dato registrado en la respuesta de la presente pregunta, o de los datos que derivan de la misma, favor de anotarlo en el siguiente espacio. De lo contrario, déjelo en blanco."]
[]
[]
[]
[]
[]
[]
[]
["2.69.-","Seleccione los indicadores de servicios que durante el año 2025 existieron en la institución registral de la entidad federativa.",null,null,null,null,null,null,null,null,null,null,null,null,null,null,null,null,null,null,null,null,null,null,null,null,null,null,null,null,null,null,{"$f":"IF(AG12=\"X\",IF(COUNTBLANK(C241:C254)=14,1,0),0)","v":0}]
[null,null,"Puede seleccionar con \"X\" más de un código. "]
[null,null,"Si elige el numeral 13 o el 99, no marque otro código. "]
[]
[null,null,null,"1. Servicios electrónicos de consulta en oficinas de la institución registral"]
[null,null,null,"2. Servicios electrónicos de consulta registral por Internet"]
[null,null,null,"3. Portal de servicios a grandes usuarios"]
[null,null,null,"4. Tiempo para procesar la inscripción de una hipoteca"]
[null,null,null,"5. Tiempo para procesar una compraventa "]
[null,null,null,"6. Tiempo para expedir certificado de libertad de gravamen "]
[null,null,null,"7. Costos por proceso"]
[null,null,null,"8. Consulta directa de libros "]
[null,null,null,"9. Servicios en ventanilla"]
[null,null,null,"10. Servicios electrónicos en autoservicio"]
[null,null,null,"11. Servicios electrónicos"]
[null,null,null,"12. Productividad"]
[null,null,null,"13. Ninguno"]
[null,null,null,"99. No se sabe"]
[]
[null,null,"En caso de tener algún comentario u observación al dato registrado en la respuesta de la presente pregunta, o de los datos que derivan de la misma, favor de anotarlo en el siguiente espacio. De lo contrario, déjelo en blanco."]
[]
[]
[]
[]
[]
[]
[]
["2.70.-","Seleccione los indicadores de operación que durante el año 2025 existieron en la institución registral de la entidad federativa.",null,null,null,null,null,null,null,null,null,null,null,null,null,null,null,null,null,null,null,null,null,null,null,null,null,null,null,null,null,null,{"$f":"IF(AG12=\"X\",IF(COUNTBLANK(C268:C277)=10,1,0),0)","v":0}]
[null,null,"Puede seleccionar con \"X\" más de un código. "]
[null,null,"Si elige el numeral 9 o el 99, no marque otro código. "]
[]
[null,null,null,"1. Solicitudes nuevas"]
[null,null,null,"2. Solicitudes resueltas "]
[null,null,null,"3. Solicitudes pendientes "]
[null,null,null,"4. Recursos de inconformidad"]
[null,null,null,"5. Rectificaciones"]
[null,null,null,"6. Información financiera "]
[null,null,null,"7. Costos"]
[null,null,null,"8. Tarifas"]
[null,null,null,"9. Ninguno"]
[null,null,null,"99. No se sabe"]
[]
[null,null,"En caso de tener algún comentario u observación al dato registrado en la respuesta de la presente pregunta, o de los datos que derivan de la misma, favor de anotarlo en el siguiente espacio. De lo contrario, déjelo en blanco."]

{"sheet":"CNGE_2026_M6_Secc2_Sub7","index":10,"n_rows":87,"n_cols":38,"rows_kept":87,"cut":false,"hidden":true,"merged":[[86,2,86,29],[87,2,87,29],[82,3,82,10],[82,12,82,19],[82,20,84,29],[83,3,83,10],[83,12,83,19],[84,3,84,10],[84,12,84,19],[78,2,78,5],[78,6,78,29],[80,2,80,29],[81,3,81,10],[81,12,81,19],[81,21,81,29],[74,3,74,14],[74,15,74,20],[75,3,75,14],[75,15,75,20],[76,3,76,14],[76,15,76,20],[71,3,71,14],[71,15,71,20],[72,3,72,14],[72,15,72,20],[73,3,73,14],[73,15,73,20],[68,3,68,14],[68,15,68,20],[69,3,69,14],[69,15,69,20],[70,3,70,14],[70,15,70,20],[65,3,65,14],[65,15,65,20],[66,3,66,14],[66,15,66,20],[67,3,67,14],[67,15,67,20],[62,3,62,14],[62,15,62,20],[63,3,63,14],[63,15,63,20],[64,3,64,14],[64,15,64,20],[59,3,59,14],[59,15,59,20],[60,3,60,14],[60,15,60,20],[61,3,61,14],[61,15,61,20],[58,3,58,14],[58,15,58,20],[38,1,38,29],[39,2,39,29],[43,2,43,29],[44,2,44,29],[51,1,51,29],[52,2,52,29],[53,2,53,29],[54,2,54,29],[56,2,57,14],[56,15,57,20],[56,21,56,29],[31,2,31,29],[22,2,22,29],[23,2,23,29],[24,2,24,29],[25,2,25,29],[27,12,27,17],[27,18,27,23],[27,24,27,29],[28,3,28,11],[28,12,28,17],[28,18,28,23],[28,24,28,29],[30,2,30,29],[21,1,21,29],[9,1,9,29],[10,1,10,29],[11,2,11,29],[12,2,12,29],[13,2,13,29],[14,2,14,29],[15,2,15,29],[16,2,16,29],[17,2,17,29],[18,2,18,29],[19,2,19,29],[0,1,0,29],[2,1,2,29],[4,1,4,29],[6,26,6,29],[7,1,7,11],[7,13,7,14]]}
[null,"CENSO NACIONAL DE GOBIERNOS\nESTATALES 2026",null,null,null,null,null,null,null,null,null,null,null,null,null,null,null,null,null,null,null,null,null,null,null,null,null,null,null,null,null,null,{"$f":"IF(SUM(AG10)>0,1,0)","v":0},{"$f":"IF(SUM(AL32)>0,1,0)","v":0}]
[]
[null,"Módulo 6.\nCatastro, registro y territorio"]
[]
[null,"Sección II. Registro Público de la Propiedad"]
[]
[null,"Entidad:",null,null,null,null,null,null,null,null,null,null,null,"Clave:",null,null,null,null,null,null,null,null,null,null,null,null,"Índice"]
[null,{"$f":"IF(Índice!B9=\"\",\"\",Índice!B9)","v":""},null,null,null,null,null,null,null,null,null,null,null,{"$f":"IF(Índice!N9=\"\",\"\",Índice!N9)","v":""}]
[]
[null,"II.7 Vinculación e intercambio de información registral",null,null,null,null,null,null,null,null,null,null,null,null,null,null,null,null,null,null,null,null,null,null,null,null,null,null,null,null,null,null,{"$f":"IF(SUM(AG22,AG39,AG52,AG79)=0,0,1)","v":0}]
[null,"Instrucciones generales para las preguntas de la subsección:"]
[null,null,"1.- Periodo de referencia de los datos: \nAl cierre del año: la información se refiere a lo existente al 31 de diciembre de 2025.\nDurante el año: la información se refiere a lo existente del 1 de enero al 31 de diciembre de 2025."]
[null,null,"2.- Los catálogos utilizados en el presente cuestionario corresponden a denominaciones estándar, de tal forma que si el nombre de alguna clasificación no coincide exactamente con la utilizada en su entidad federativa, debe registrar los datos en aquella que sea homóloga. ",null,null,null,null,null,null,null,null,null,null,null,null,null,null,null,null,null,null,null,null,null,null,null,null,null,null,null,null,null,"Aux"]
[null,null,"3.- En caso de que los registros con los que cuente no le permitan desglosar la información de acuerdo con los requerimientos solicitados, anote \"NS\" (No se sabe) en las celdas donde no disponga de información. En el recuadro para comentarios de cada pregunta debe proporcionar una justificación respecto del uso del \"NS\" en determinado reactivo.",null,null,null,null,null,null,null,null,null,null,null,null,null,null,null,null,null,null,null,null,null,null,null,null,null,null,null,null,null,{"$f":"IF(Índice!B9<>\"\",\"X\",\"\")","v":""}]
[null,null,"4.- Las cifras deben anotarse con números enteros y sin espacio de separación ni comas, independientemente de si son miles o millones. En el caso de los porcentajes, estos además deben de ir sin el símbolo %."]
[null,null,"5.- No deje celdas en blanco, salvo en los casos en que la instrucción así lo solicite. ",null,null,null,null,null,null,null,null,null,null,null,null,null,null,null,null,null,null,null,null,null,null,null,null,null,null,null,null,null,"Aux2"]
[null,null,"6.- En el caso de las tablas, deben estar contestadas todas las celdas, ya sea anotando \"0\" (cero), en caso de datos numéricos, o eligiendo algún código según el formato de respuesta.",null,null,null,null,null,null,null,null,null,null,null,null,null,null,null,null,null,null,null,null,null,null,null,null,null,null,null,null,null,{"$f":"IF(Índice!B9=\"\",\"X\",\"\")","v":"X"}]
[null,null,"7.- En las preguntas con listas desplegables, seleccione la opción que corresponda a la realidad de la entidad federativa."]
[null,null,"8.- Antes de concluir el cuestionario, revise que no haya celdas rellenas con color rojo, pues dicho color indica que hay error en la información y debe de corregirse. También asegúrese de que no haya celdas con color amarillo, ya que eso significa que falta una respuesta y debe proporcionarse la información.\t"]
[null,null,"9.- ¡Importante!: recuerde que todos los datos proporcionados en el cuestionario deben corresponder a los asentados en sus registros administrativos."]
[]
["2.71.-","Indique si al cierre del año 2025 existió vinculación de bienes inmuebles entre la institución registral y el catastro estatal mediante la asociación de un identificador común, ya sea la clave catastral, el folio real electrónico, domicilio u otro elemento. Si la respuesta es afirmativa, anote el total de bienes inmuebles vigentes vinculados y el porcentaje de vinculación.",null,null,null,null,null,null,null,null,null,null,null,null,null,null,null,null,null,null,null,null,null,null,null,null,null,null,null,null,null,null,{"$f":"IF(AG17=\"\",IF(M29=1,IF(COUNTBLANK(S29)+COUNTBLANK(Y29)>0,1,0),0)+COUNTBLANK(M29),0)","v":0}]
[null,null,"Si desconoce alguna cantidad, registre \"NS\" en la celda correspondiente."]
[null,null,"Registre la cantidad de bienes inmuebles vigentes vinculados omitiendo duplicados."]
[null,null,"Registre el porcentaje de vinculación con números enteros sin el símbolo %."]
[null,null,"Las cantidades deben registrarse con números enteros y sin comas."]
[]
[null,null,null,null,null,null,null,null,null,null,null,null,"¿Existió vinculación?\n(1.Sí / 2.No / 9.No se sabe)",null,null,null,null,null,"Total de bienes inmuebles vinculados",null,null,null,null,null,"Porcentaje de vinculación"]
[null,null,"1.","Institución registral y catastro estatal",null,null,null,null,null,null,null,null,null,null,null,null,null,null,null,null,null,null,null,null,null,null,null,null,null,null,null,null,0]
[]
[null,null,"En caso de tener algún comentario u observación al dato registrado en la respuesta de la presente pregunta, o de los datos que derivan de la misma, favor de anotarlo en el siguiente espacio. De lo contrario, déjelo en blanco."]
[null,null,null,null,null,null,null,null,null,null,null,null,null,null,null,null,null,null,null,null,null,null,null,null,null,null,null,null,null,null,null,null,null,null,null,null,0,{"$f":"IF(AK32=1,COUNTBLANK(C32),0)","v":0}]
[]
[]
[]
[]
[]
[]
["2.72.-","Indique si la institución registral de la entidad federativa tuvo intercambio de información con usuarios y/ o instituciones durante el año 2025.",null,null,null,null,null,null,null,null,null,null,null,null,null,null,null,null,null,null,null,null,null,null,null,null,null,null,null,null,null,null,{"$f":"IF(AG17=\"\",IF(COUNTBLANK(C42)+COUNTBLANK(I42)+COUNTBLANK(T42)=3,1,0),0)","v":0}]
[null,null,"Seleccione con \"X\" un solo código."]
[]
[null,null,null,"1. Sí",null,null,null,null,null,"2. No (pase a la pregunta 2.74)",null,null,null,null,null,null,null,null,null,null,"9. No se sabe (pase a la pregunta 2.74)"]
[]
[null,null,"En caso de tener algún comentario u observación al dato registrado en la respuesta de la presente pregunta, o de los datos que derivan de la misma, favor de anotarlo en el siguiente espacio. De lo contrario, déjelo en blanco."]
[]
[]
[]
[]
[]
[]
[]
["2.73.-","Indique los usuarios y/ o instituciones con los que la institución registral de la entidad federativa tuvo intercambio de información, así como los medios utilizados durante el año 2025. ",null,null,null,null,null,null,null,null,null,null,null,null,null,null,null,null,null,null,null,null,null,null,null,null,null,null,null,null,null,null,{"$f":"IF(UPPER(C42)=\"X\",IF(P59=1,IF(COUNTBLANK(V59:AD59)=9,1,0),0)+IF(P60=1,IF(COUNTBLANK(V60:AD60)=9,1,0),0)+IF(P61=1,IF(COUNTBLANK(V61:AD61)=9,1,0),0)+IF(P1652=1,IF(COUNTBLANK(V1652:AD1652)=9,1,0),0)+IF(P63=1,IF(COUNTBLANK(V63:AD63)=9,1,0),0)+IF(P64=1,IF(COUNTBLANK(V64:AD64)=9,1,0),0)+IF(P65=1,IF(COUNTBLANK(V65:AD65)=9,1,0),0)+IF(P66=1,IF(COUNTBLANK(V66:AD66)=9,1,0),0)+IF(P67=1,IF(COUNTBLANK(V67:AD67)=9,1,0),0)+IF(P68=1,IF(COUNTBLANK(V68:AD68)=9,1,0),0)+IF(P69=1,IF(COUNTBLANK(V69:AD69)=9,1,0),0)+IF(P70=1,IF(COUNTBLANK(V70:AD70)=9,1,0),0)+IF(P71=1,IF(COUNTBLANK(V71:AD71)=9,1,0),0)+IF(P72=1,IF(COUNTBLANK(V72:AD72)=9,1,0),0)+IF(P73=1,IF(COUNTBLANK(V73:AD73)=9,1,0),0)+IF(P74=1,IF(COUNTBLANK(V74:AD74)=9,1,0),0)+IF(P75=1,IF(COUNTBLANK(V75:AD75)=9,1,0),0)+IF(P76=1,IF(COUNTBLANK(V76:AD76)=9,1,0),0)+IF(P77=1,IF(COUNTBLANK(V77:AD77)=9,1,0),0)+COUNTBLANK(P59:P77),0)","v":0}]
[null,null,"Puede seleccionar con \"X\" más de un medio de intercambio de información."]
[null,null,"Si selecciona el numeral 9 del catálogo de medios de intercambio de información, no marque otro medio."]
[null,null,"Si responde \"1. Sí\" en el numeral 19, anote el otro usuario o institución en el recuadro que está al final de la tabla."]
[]
[null,null,"Usuarios o instituciones",null,null,null,null,null,null,null,null,null,null,null,null,"¿Existió intercambio de información?\n(1.Sí / 2.No / 9.No se sabe)",null,null,null,null,null,"Medios de intercambio de información\n(ver catálogo)"]
[null,null,null,null,null,null,null,null,null,null,null,null,null,null,null,null,null,null,null,null,null,1,2,3,4,5,6,7,8,9]
[null,null,"1.","FOVISSSTE"]
[null,null,"2.","INDAABIN"]
[null,null,"3.","INFONAVIT"]
[null,null,"4.","INSUS"]
[null,null,"5.","RAN"]
[null,null,"6.","SAT"]
[null,null,"7.","SEDATU"]
[null,null,"8.","SHF"]
[null,null,"9.","UIF"]
[null,null,"10.","Catastro estatal "]
[null,null,"11.","Instituto estatal de vivienda"]
[null,null,"12.","Organismos regularizadores de la tenencia de la tierra estatales"]
[null,null,"13.","Poder judicial estatal y/ o federal"]
[null,null,"14.","Procuraduría y/ o fiscalía estatal de justicia"]
[null,null,"15.","Secretaría de planeación y finanzas estatal"]
[null,null,"16.","Catastros municipales"]
[null,null,"17.","Notarios"]
[null,null,"18.","Corredores públicos"]
[null,null,"19.","Otro (especifique)"]
[]
[null,null,"Otro usuario o institución:\n(especifique)",null,null,null,null,null,null,null,null,null,null,null,null,null,null,null,null,null,null,null,null,null,null,null,null,null,null,null,null,null,{"$f":"IF(P77=1,COUNTBLANK(G79),0)","v":0}]
[]
[null,null,"Catálogo de medios de intercambio de información"]
[null,null,"1.","Correo electrónico",null,null,null,null,null,null,null,"5.","Servicios WMS",null,null,null,null,null,null,null,"9.","No se sabe"]
[null,null,"2.","Teléfono",null,null,null,null,null,null,null,"6.","Interconexión a bases de datos"]
[null,null,"3.","CD",null,null,null,null,null,null,null,"7.","Web"]
[null,null,"4.","USB",null,null,null,null,null,null,null,"8.","Oficio o por medios impresos"]
[]
[null,null,"En caso de tener algún comentario u observación al dato registrado en la respuesta de la presente pregunta, o de los datos que derivan de la misma, favor de anotarlo en el siguiente espacio. De lo contrario, déjelo en blanco."]

{"sheet":"CNGE_2026_M6_Secc2_Sub8","index":11,"n_rows":52,"n_cols":37,"rows_kept":52,"cut":false,"hidden":true,"merged":[[52,2,52,29],[45,3,45,23],[45,24,45,29],[46,3,46,23],[46,24,46,29],[47,3,47,23],[47,24,47,29],[48,3,48,23],[48,24,48,29],[49,3,49,23],[49,24,49,29],[51,2,51,29],[42,3,42,23],[42,24,42,29],[43,3,43,23],[43,24,43,29],[44,3,44,23],[44,24,44,29],[41,3,41,23],[41,24,41,29],[22,2,22,29],[26,2,26,29],[27,2,27,29],[34,1,34,29],[35,2,35,29],[36,2,36,29],[37,2,37,29],[39,2,39,23],[39,24,39,29],[40,3,40,23],[40,24,40,29],[21,1,21,29],[9,1,9,29],[10,1,10,29],[11,2,11,29],[12,2,12,29],[13,2,13,29],[14,2,14,29],[15,2,15,29],[16,2,16,29],[17,2,17,29],[18,2,18,29],[19,2,19,29],[0,1,0,29],[2,1,2,29],[4,1,4,29],[6,26,6,29],[7,1,7,11],[7,13,7,14]]}
[null,"CENSO NACIONAL DE GOBIERNOS\nESTATALES 2026",null,null,null,null,null,null,null,null,null,null,null,null,null,null,null,null,null,null,null,null,null,null,null,null,null,null,null,null,null,null,{"$f":"IF(SUM(AG10)>0,1,0)","v":0}]
[]
[null,"Módulo 6.\nCatastro, registro y territorio"]
[]
[null,"Sección II. Registro Público de la Propiedad"]
[]
[null,"Entidad:",null,null,null,null,null,null,null,null,null,null,null,"Clave:",null,null,null,null,null,null,null,null,null,null,null,null,"Índice"]
[null,{"$f":"IF(Índice!B9=\"\",\"\",Índice!B9)","v":""},null,null,null,null,null,null,null,null,null,null,null,{"$f":"IF(Índice!N9=\"\",\"\",Índice!N9)","v":""}]
[]
[null,"II.8 Programa de modernización de los registros públicos de la propiedad y catastros",null,null,null,null,null,null,null,null,null,null,null,null,null,null,null,null,null,null,null,null,null,null,null,null,null,null,null,null,null,null,{"$f":"IF(SUM(AG22,AG35)=0,0,1)","v":0}]
[null,"Instrucciones generales para las preguntas de la subsección:"]
[null,null,"1.- Periodo de referencia de los datos: \nAl cierre del año: la información se refiere a lo existente al 31 de diciembre de 2025.\nDurante el año: la información se refiere a lo existente del 1 de enero al 31 de diciembre de 2025."]
[null,null,"2.- Los catálogos utilizados en el presente cuestionario corresponden a denominaciones estándar, de tal forma que si el nombre de alguna clasificación no coincide exactamente con la utilizada en su entidad federativa, debe registrar los datos en aquella que sea homóloga. ",null,null,null,null,null,null,null,null,null,null,null,null,null,null,null,null,null,null,null,null,null,null,null,null,null,null,null,null,null,"Aux"]
[null,null,"3.- En caso de que los registros con los que cuente no le permitan desglosar la información de acuerdo con los requerimientos solicitados, anote \"NS\" (No se sabe) en las celdas donde no disponga de información. En el recuadro para comentarios de cada pregunta debe proporcionar una justificación respecto del uso del \"NS\" en determinado reactivo.",null,null,null,null,null,null,null,null,null,null,null,null,null,null,null,null,null,null,null,null,null,null,null,null,null,null,null,null,null,{"$f":"IF(Índice!B9<>\"\",\"X\",\"\")","v":""}]
[null,null,"4.- Las cifras deben anotarse con números enteros y sin espacio de separación ni comas, independientemente de si son miles o millones. En el caso de los porcentajes, estos además deben de ir sin el símbolo %."]
[null,null,"5.- No deje celdas en blanco, salvo en los casos en que la instrucción así lo solicite. ",null,null,null,null,null,null,null,null,null,null,null,null,null,null,null,null,null,null,null,null,null,null,null,null,null,null,null,null,null,"Aux2"]
[null,null,"6.- En el caso de las tablas, deben estar contestadas todas las celdas, ya sea anotando \"0\" (cero), en caso de datos numéricos, o eligiendo algún código según el formato de respuesta.",null,null,null,null,null,null,null,null,null,null,null,null,null,null,null,null,null,null,null,null,null,null,null,null,null,null,null,null,null,{"$f":"IF(Índice!B9=\"\",\"X\",\"\")","v":"X"}]
[null,null,"7.- En las preguntas con listas desplegables, seleccione la opción que corresponda a la realidad de la entidad federativa."]
[null,null,"8.- Antes de concluir el cuestionario, revise que no haya celdas rellenas con color rojo, pues dicho color indica que hay error en la información y debe de corregirse. También asegúrese de que no haya celdas con color amarillo, ya que eso significa que falta una respuesta y debe proporcionarse la información.\t"]
[null,null,"9.- ¡Importante!: recuerde que todos los datos proporcionados en el cuestionario deben corresponder a los asentados en sus registros administrativos."]
[]
["2.74.-","Indique si la institución registral de la entidad federativa accedió al programa de modernización de los registros públicos de la propiedad y catastros de la SEDATU durante el año 2025.",null,null,null,null,null,null,null,null,null,null,null,null,null,null,null,null,null,null,null,null,null,null,null,null,null,null,null,null,null,null,{"$f":"IF(AG17=\"\",IF(COUNTBLANK(C25)+COUNTBLANK(I25)+COUNTBLANK(T25)=3,1,0),0)","v":0}]
[null,null,"Seleccione con \"X\" un solo código."]
[]
[null,null,null,"1. Sí",null,null,null,null,null,"2. No (finalizar cuestionario)",null,null,null,null,null,null,null,null,null,null,"9. No se sabe (finalizar cuestionario)"]
[]
[null,null,"En caso de tener algún comentario u observación al dato registrado en la respuesta de la presente pregunta, o de los datos que derivan de la misma, favor de anotarlo en el siguiente espacio. De lo contrario, déjelo en blanco."]
[null,null,null,null,null,null,null,null,null,null,null,null,null,null,null,null,null,null,null,null,null,null,null,null,null,null,null,null,null,null,null,null,null,null,null,null,0]
[]
[]
[]
[]
[]
[]
["2.75.-","Registre los porcentajes de avance actual que se obtuvieron durante el año 2025 para cada componente del Modelo Integral del Registro Público de la Propiedad.",null,null,null,null,null,null,null,null,null,null,null,null,null,null,null,null,null,null,null,null,null,null,null,null,null,null,null,null,null,null,{"$f":"IF(UPPER(C25)=\"X\",IF(COUNTBLANK(Y41:Y50)>0,1,0),0)","v":0}]
[null,null,"Si desconoce cuál es el porcentaje de avance de algún componente, registre \"NS\" en la celda correspondiente."]
[null,null,"Si únicamente conoce la calificación total, anótela en la celda que corresponde y registre \"NS\" en las celdas de porcentaje de avance por componente."]
[null,null,"Registre el porcentaje con números enteros hasta con dos decimales sin el símbolo %. "]
[]
[null,null,"Componentes del Modelo Integral del Registro Público de la Propiedad ",null,null,null,null,null,null,null,null,null,null,null,null,null,null,null,null,null,null,null,null,null," Porcentaje de avance actual"]
[null,null,"1.","Calificación total"]
[null,null,"2.","Marco jurídico"]
[null,null,"3.","Procesos registrales"]
[null,null,"4.","Tecnologías de la información "]
[null,null,"5.","Gestión de calidad"]
[null,null,"6.","Profesionalización de la función registral"]
[null,null,"7.","Políticas institucionales "]
[null,null,"8.","Gestión y acervo documental"]
[null,null,"9.","Participación y vinculación con otros sectores"]
[null,null,"10.","Indicadores de desempeño"]
[]
[null,null,"En caso de tener algún comentario u observación al dato registrado en la respuesta de la presente pregunta, o de los datos que derivan de la misma, favor de anotarlo en el siguiente espacio. De lo contrario, déjelo en blanco."]

{"sheet":"Complemento1","index":12,"n_rows":301,"n_cols":35,"rows_kept":301,"cut":false,"hidden":true,"merged":[[300,3,300,4],[300,5,300,12],[300,13,300,15],[300,16,300,29],[299,3,299,4],[299,5,299,12],[299,13,299,15],[299,17,299,18],[299,19,299,26],[299,27,299,29],[298,3,298,4],[298,5,298,12],[298,13,298,15],[298,17,298,18],[298,19,298,26],[298,27,298,29],[297,3,297,4],[297,5,297,12],[297,13,297,15],[297,17,297,18],[297,19,297,26],[297,27,297,29],[296,3,296,4],[296,5,296,12],[296,13,296,15],[296,17,296,18],[296,19,296,26],[296,27,296,29],[295,3,295,4],[295,5,295,12],[295,13,295,15],[295,17,295,18],[295,19,295,26],[295,27,295,29],[294,3,294,4],[294,5,294,12],[294,13,294,15],[294,17,294,18],[294,19,294,26],[294,27,294,29],[293,3,293,4],[293,5,293,12],[293,13,293,15],[293,17,293,18],[293,19,293,26],[293,27,293,29],[292,3,292,4],[292,5,292,12],[292,13,292,15],[292,17,292,18],[292,19,292,26],[292,27,292,29],[291,3,291,4],[291,5,291,12],[291,13,291,15],[291,17,291,18],[291,19,291,26],[291,27,291,29],[290,3,290,4],[290,5,290,12],[290,13,290,15],[290,17,290,18],[290,19,290,26],[290,27,290,29],[289,3,289,4],[289,5,289,12],[289,13,289,15],[289,17,289,18],[289,19,289,26],[289,27,289,29],[288,3,288,4],[288,5,288,12],[288,13,288,15],[288,17,288,18],[288,19,288,26],[288,27,288,29],[287,3,287,4],[287,5,287,12],[287,13,287,15],[287,17,287,18],[287,19,287,26],[287,27,287,29],[286,3,286,4],[286,5,286,12],[286,13,286,15],[286,17,286,18],[286,19,286,26],[286,27,286,29],[285,3,285,4],[285,5,285,12],[285,13,285,15],[285,17,285,18],[285,19,285,26],[285,27,285,29],[284,3,284,4],[284,5,284,12],[284,13,284,15],[284,17,284,18],[284,19,284,26],[284,27,284,29],[283,3,283,4],[283,5,283,12],[283,13,283,15],[283,17,283,18],[283,19,283,26],[283,27,283,29],[282,3,282,4],[282,5,282,12],[282,13,282,15],[282,17,282,18],[282,19,282,26],[282,27,282,29],[281,3,281,4],[281,5,281,12],[281,13,281,15],[281,17,281,18],[281,19,281,26],[281,27,281,29],[280,3,280,4],[280,5,280,12],[280,13,280,15],[280,17,280,18],[280,19,280,26],[280,27,280,29],[279,3,279,4],[279,5,279,12],[279,13,279,15],[279,17,279,18],[279,19,279,26],[279,27,279,29],[278,3,278,4],[278,5,278,12],[278,13,278,15],[278,17,278,18],[278,19,278,26],[278,27,278,29],[277,3,277,4],[277,5,277,12],[277,13,277,15],[277,17,277,18],[277,19,277,26],[277,27,277,29],[276,3,276,4],[276,5,276,12],[276,13,276,15],[276,17,276,18],[276,19,276,26],[276,27,276,29],[275,3,275,4],[275,5,275,12],[275,13,275,15],[275,17,275,18],[275,19,275,26],[275,27,275,29],[274,3,274,4],[274,5,274,12],[274,13,274,15],[274,17,274,18],[274,19,274,26],[274,27,274,29],[273,3,273,4],[273,5,273,12],[273,13,273,15],[273,17,273,18],[273,19,273,26],[273,27,273,29],[272,3,272,4],[272,5,272,12],[272,13,272,15],[272,17,272,18],[272,19,272,26],[272,27,272,29],[271,3,271,4],[271,5,271,12],[271,13,271,15],[271,17,271,18],[271,19,271,26],[271,27,271,29],[270,3,270,4],[270,5,270,12],[270,13,270,15],[270,17,270,18],[270,19,270,26],[270,27,270,29],[269,3,269,4],[269,5,269,12],[269,13,269,15],[269,17,269,18],[269,19,269,26],[269,27,269,29],[268,3,268,4],[268,5,268,12],[268,13,268,15],[268,17,268,18],[268,19,268,26],[268,27,268,29],[267,3,267,4],[267,5,267,12],[267,13,267,15],[267,17,267,18],[267,19,267,26],[267,27,267,29],[266,3,266,4],[266,5,266,12],[266,13,266,15],[266,17,266,18],[266,19,266,26],[266,27,266,29],[265,3,265,4],[265,5,265,12],[265,13,265,15],[265,17,265,18],[265,19,265,26],[265,27,265,29],[264,3,264,4],[264,5,264,12],[264,13,264,15],[264,17,264,18],[264,19,264,26],[264,27,264,29],[263,3,263,4],[263,5,263,12],[263,13,263,15],[263,17,263,18],[263,19,263,26],[263,27,263,29],[262,3,262,4],[262,5,262,12],[262,13,262,15],[262,17,262,18],[262,19,262,26],[262,27,262,29],[261,3,261,4],[261,5,261,12],[261,13,261,15],[261,17,261,18],[261,19,261,26],[261,27,261,29],[260,3,260,4],[260,5,260,12],[260,13,260,15],[260,17,260,18],[260,19,260,26],[260,27,260,29],[259,3,259,4],[259,5,259,12],[259,13,259,15],[259,17,259,18],[259,19,259,26],[259,27,259,29],[258,3,258,4],[258,5,258,12],[258,13,258,15],[258,17,258,18],[258,19,258,26],[258,27,258,29],[257,3,257,4],[257,5,257,12],[257,13,257,15],[257,17,257,18],[257,19,257,26],[257,27,257,29],[256,3,256,4],[256,5,256,12],[256,13,256,15],[256,17,256,18],[256,19,256,26],[256,27,256,29],[255,3,255,4],[255,5,255,12],[255,13,255,15],[255,17,255,18],[255,19,255,26],[255,27,255,29],[254,3,254,4],[254,5,254,12],[254,13,254,15],[254,17,254,18],[254,19,254,26],[254,27,254,29],[253,3,253,4],[253,5,253,12],[253,13,253,15],[253,17,253,18],[253,19,253,26],[253,27,253,29],[252,3,252,4],[252,5,252,12],[252,13,252,15],[252,17,252,18],[252,19,252,26],[252,27,252,29],[251,3,251,4],[251,5,251,12],[251,13,251,15],[251,17,251,18],[251,19,251,26],[251,27,251,29],[250,3,250,4],[250,5,250,12],[250,13,250,15],[250,17,250,18],[250,19,250,26],[250,27,250,29],[249,3,249,4],[249,5,249,12],[249,13,249,15],[249,17,249,18],[249,19,249,26],[249,27,249,29],[248,3,248,4],[248,5,248,12],[248,13,248,15],[248,17,248,18],[248,19,248,26],[248,27,248,29],[247,3,247,4],[247,5,247,12],[247,13,247,15],[247,17,247,18],[247,19,247,26],[247,27,247,29],[246,3,246,4],[246,5,246,12],[246,13,246,15],[246,17,246,18],[246,19,246,26],[246,27,246,29],[245,3,245,4],[245,5,245,12],[245,13,245,15],[245,17,245,18],[245,19,245,26],[245,27,245,29],[244,3,244,4],[244,5,244,12],[244,13,244,15],[244,17,244,18],[244,19,244,26],[244,27,244,29],[243,3,243,4],[243,5,243,12],[243,13,243,15],[243,17,243,18],[243,19,243,26],[243,27,243,29],[242,3,242,4],[242,5,242,12],[242,13,242,15],[242,17,242,18],[242,19,242,26],[242,27,242,29],[241,3,241,4],[241,5,241,12],[241,13,241,15],[241,17,241,18],[241,19,241,26],[241,27,241,29],[240,3,240,4],[240,5,240,12],[240,13,240,15],[240,17,240,18],[240,19,240,26],[240,27,240,29],[239,3,239,4],[239,5,239,12],[239,13,239,15],[239,17,239,18],[239,19,239,26],[239,27,239,29],[238,3,238,4],[238,5,238,12],[238,13,238,15],[238,17,238,18],[238,19,238,26],[238,27,238,29],[237,3,237,4],[237,5,237,12],[237,13,237,15],[237,17,237,18],[237,19,237,26],[237,27,237,29],[236,3,236,4],[236,5,236,12],[236,13,236,15],[236,17,236,18],[236,19,236,26],[236,27,236,29],[235,3,235,4],[235,5,235,12],[235,13,235,15],[235,17,235,18],[235,19,235,26],[235,27,235,29],[234,3,234,4],[234,5,234,12],[234,13,234,15],[234,17,234,18],[234,19,234,26],[234,27,234,29],[233,3,233,4],[233,5,233,12],[233,13,233,15],[233,17,233,18],[233,19,233,26],[233,27,233,29],[232,3,232,4],[232,5,232,12],[232,13,232,15],[232,17,232,18],[232,19,232,26],[232,27,232,29],[231,3,231,4],[231,5,231,12],[231,13,231,15],[231,17,231,18],[231,19,231,26],[231,27,231,29],[230,3,230,4],[230,5,230,12],[230,13,230,15],[230,17,230,18],[230,19,230,26],[230,27,230,29],[229,3,229,4],[229,5,229,12],[229,13,229,15],[229,17,229,18],[229,19,229,26],[229,27,229,29],[228,3,228,4],[228,5,228,12],[228,13,228,15],[228,17,228,18],[228,19,228,26],[228,27,228,29],[227,3,227,4],[227,5,227,12],[227,13,227,15],[227,17,227,18],[227,19,227,26],[227,27,227,29],[226,3,226,4],[226,5,226,12],[226,13,226,15],[226,17,226,18],[226,19,226,26],[226,27,226,29],[225,3,225,4],[225,5,225,12],[225,13,225,15],[225,17,225,18],[225,19,225,26],[225,27,225,29],[224,3,224,4],[224,5,224,12],[224,13,224,15],[224,17,224,18],[224,19,224,26],[224,27,224,29],[223,3,223,4],[223,5,223,12],[223,13,223,15],[223,17,223,18],[223,19,223,26],[223,27,223,29],[222,3,222,4],[222,5,222,12],[222,13,222,15],[222,17,222,18],[222,19,222,26],[222,27,222,29],[221,3,221,4],[221,5,221,12],[221,13,221,15],[221,17,221,18],[221,19,221,26],[221,27,221,29],[220,3,220,4],[220,5,220,12],[220,13,220,15],[220,17,220,18],[220,19,220,26],[220,27,220,29],[219,3,219,4],[219,5,219,12],[219,13,219,15],[219,17,219,18],[219,19,219,26],[219,27,219,29],[218,3,218,4],[218,5,218,12],[218,13,218,15],[218,17,218,18],[218,19,218,26],[218,27,218,29],[217,3,217,4],[217,5,217,12],[217,13,217,15],[217,17,217,18],[217,19,217,26],[217,27,217,29],[216,3,216,4],[216,5,216,12],[216,13,216,15],[216,17,216,18],[216,19,216,26],[216,27,216,29],[215,3,215,4],[215,5,215,12],[215,13,215,15],[215,17,215,18],[215,19,215,26],[215,27,215,29],[214,3,214,4],[214,5,214,12],[214,13,214,15],[214,17,214,18],[214,19,214,26],[214,27,214,29],[213,3,213,4],[213,5,213,12],[213,13,213,15],[213,17,213,18],[213,19,213,26],[213,27,213,29],[212,3,212,4],[212,5,212,12],[212,13,212,15],[212,17,212,18],[212,19,212,26],[212,27,212,29],[211,3,211,4],[211,5,211,12],[211,13,211,15],[211,17,211,18],[211,19,211,26],[211,27,211,29],[210,3,210,4],[210,5,210,12],[210,13,210,15],[210,17,210,18],[210,19,210,26],[210,27,210,29],[209,3,209,4],[209,5,209,12],[209,13,209,15],[209,17,209,18],[209,19,209,26],[209,27,209,29],[208,3,208,4],[208,5,208,12],[208,13,208,15],[208,17,208,18],[208,19,208,26],[208,27,208,29],[207,3,207,4],[207,5,207,12],[207,13,207,15],[207,17,207,18],[207,19,207,26],[207,27,207,29],[206,3,206,4],[206,5,206,12],[206,13,206,15],[206,17,206,18],[206,19,206,26],[206,27,206,29],[205,3,205,4],[205,5,205,12],[205,13,205,15],[205,17,205,18],[205,19,205,26],[205,27,205,29],[204,3,204,4],[204,5,204,12],[204,13,204,15],[204,17,204,18],[204,19,204,26],[204,27,204,29],[203,3,203,4],[203,5,203,12],[203,13,203,15],[203,17,203,18],[203,19,203,26],[203,27,203,29],[202,3,202,4],[202,5,202,12],[202,13,202,15],[202,17,202,18],[202,19,202,26],[202,27,202,29],[201,3,201,4],[201,5,201,12],[201,13,201,15],[201,17,201,18],[201,19,201,26],[201,27,201,29],[200,3,200,4],[200,5,200,12],[200,13,200,15],[200,17,200,18],[200,19,200,26],[200,27,200,29],[199,3,199,4],[199,5,199,12],[199,13,199,15],[199,17,199,18],[199,19,199,26],[199,27,199,29],[198,3,198,4],[198,5,198,12],[198,13,198,15],[198,17,198,18],[198,19,198,26],[198,27,198,29],[197,3,197,4],[197,5,197,12],[197,13,197,15],[197,17,197,18],[197,19,197,26],[197,27,197,29],[196,3,196,4],[196,5,196,12],[196,13,196,15],[196,17,196,18],[196,19,196,26],[196,27,196,29],[195,3,195,4],[195,5,195,12],[195,13,195,15],[195,17,195,18],[195,19,195,26],[195,27,195,29],[194,3,194,4],[194,5,194,12],[194,13,194,15],[194,17,194,18],[194,19,194,26],[194,27,194,29],[193,3,193,4],[193,5,193,12],[193,13,193,15],[193,17,193,18],[193,19,193,26],[193,27,193,29],[192,3,192,4],[192,5,192,12],[192,13,192,15],[192,17,192,18],[192,19,192,26],[192,27,192,29],[191,3,191,4],[191,5,191,12],[191,13,191,15],[191,17,191,18],[191,19,191,26],[191,27,191,29],[190,3,190,4],[190,5,190,12],[190,13,190,15],[190,17,190,18],[190,19,190,26],[190,27,190,29],[189,3,189,4],[189,5,189,12],[189,13,189,15],[189,17,189,18],[189,19,189,26],[189,27,189,29],[188,3,188,4],[188,5,188,12],[188,13,188,15],[188,17,188,18],[188,19,188,26],[188,27,188,29],[187,3,187,4],[187,5,187,12],[187,13,187,15],[187,17,187,18],[187,19,187,26],[187,27,187,29],[186,3,186,4],[186,5,186,12],[186,13,186,15],[186,17,186,18],[186,19,186,26],[186,27,186,29],[185,3,185,4],[185,5,185,12],[185,13,185,15],[185,17,185,18],[185,19,185,26],[185,27,185,29],[184,3,184,4],[184,5,184,12],[184,13,184,15],[184,17,184,18],[184,19,184,26],[184,27,184,29],[183,3,183,4],[183,5,183,12],[183,13,183,15],[183,17,183,18],[183,19,183,26],[183,27,183,29],[182,3,182,4],[182,5,182,12],[182,13,182,15],[182,17,182,18],[182,19,182,26],[182,27,182,29],[181,3,181,4],[181,5,181,12],[181,13,181,15],[181,17,181,18],[181,19,181,26],[181,27,181,29],[180,3,180,4],[180,5,180,12],[180,13,180,15],[180,17,180,18],[180,19,180,26],[180,27,180,29],[179,3,179,4],[179,5,179,12],[179,13,179,15],[179,17,179,18],[179,19,179,26],[179,27,179,29],[178,3,178,4],[178,5,178,12],[178,13,178,15],[178,17,178,18],[178,19,178,26],[178,27,178,29],[177,3,177,4],[177,5,177,12],[177,13,177,15],[177,17,177,18],[177,19,177,26],[177,27,177,29],[176,3,176,4],[176,5,176,12],[176,13,176,15],[176,17,176,18],[176,19,176,26],[176,27,176,29],[175,3,175,4],[175,5,175,12],[175,13,175,15],[175,17,175,18],[175,19,175,26],[175,27,175,29],[174,3,174,4],[174,5,174,12],[174,13,174,15],[174,17,174,18],[174,19,174,26],[174,27,174,29],[173,3,173,4],[173,5,173,12],[173,13,173,15],[173,17,173,18],[173,19,173,26],[173,27,173,29],[172,3,172,4],[172,5,172,12],[172,13,172,15],[172,17,172,18],[172,19,172,26],[172,27,172,29],[171,3,171,4],[171,5,171,12],[171,13,171,15],[171,17,171,18],[171,19,171,26],[171,27,171,29],[170,3,170,4],[170,5,170,12],[170,13,170,15],[170,17,170,18],[170,19,170,26],[170,27,170,29],[169,3,169,4],[169,5,169,12],[169,13,169,15],[169,17,169,18],[169,19,169,26],[169,27,169,29],[168,3,168,4],[168,5,168,12],[168,13,168,15],[168,17,168,18],[168,19,168,26],[168,27,168,29],[167,3,167,4],[167,5,167,12],[167,13,167,15],[167,17,167,18],[167,19,167,26],[167,27,167,29],[166,3,166,4],[166,5,166,12],[166,13,166,15],[166,17,166,18],[166,19,166,26],[166,27,166,29],[165,3,165,4],[165,5,165,12],[165,13,165,15],[165,17,165,18],[165,19,165,26],[165,27,165,29],[164,3,164,4],[164,5,164,12],[164,13,164,15],[164,17,164,18],[164,19,164,26],[164,27,164,29],[163,3,163,4],[163,5,163,12],[163,13,163,15],[163,17,163,18],[163,19,163,26],[163,27,163,29],[162,3,162,4],[162,5,162,12],[162,13,162,15],[162,17,162,18],[162,19,162,26],[162,27,162,29],[161,3,161,4],[161,5,161,12],[161,13,161,15],[161,17,161,18],[161,19,161,26],[161,27,161,29],[160,3,160,4],[160,5,160,12],[160,13,160,15],[160,17,160,18],[160,19,160,26],[160,27,160,29],[159,3,159,4],[159,5,159,12],[159,13,159,15],[159,17,159,18],[159,19,159,26],[159,27,159,29],[158,3,158,4],[158,5,158,12],[158,13,158,15],[158,17,158,18],[158,19,158,26],[158,27,158,29],[157,3,157,4],[157,5,157,12],[157,13,157,15],[157,17,157,18],[157,19,157,26],[157,27,157,29],[156,3,156,4],[156,5,156,12],[156,13,156,15],[156,17,156,18],[156,19,156,26],[156,27,156,29],[155,3,155,4],[155,5,155,12],[155,13,155,15],[155,17,155,18],[155,19,155,26],[155,27,155,29],[154,3,154,4],[154,5,154,12],[154,13,154,15],[154,17,154,18],[154,19,154,26],[154,27,154,29],[153,3,153,4],[153,5,153,12],[153,13,153,15],[153,17,153,18],[153,19,153,26],[153,27,153,29],[152,3,152,4],[152,5,152,12],[152,13,152,15],[152,17,152,18],[152,19,152,26],[152,27,152,29],[151,3,151,4],[151,5,151,12],[151,13,151,15],[151,17,151,18],[151,19,151,26],[151,27,151,29],[150,3,150,4],[150,5,150,12],[150,13,150,15],[150,17,150,18],[150,19,150,26],[150,27,150,29],[149,3,149,4],[149,5,149,12],[149,13,149,15],[149,17,149,18],[149,19,149,26],[149,27,149,29],[148,3,148,4],[148,5,148,12],[148,13,148,15],[148,17,148,18],[148,19,148,26],[148,27,148,29],[147,3,147,4],[147,5,147,12],[147,13,147,15],[147,17,147,18],[147,19,147,26],[147,27,147,29],[146,3,146,4],[146,5,146,12],[146,13,146,15],[146,17,146,18],[146,19,146,26],[146,27,146,29],[145,3,145,4],[145,5,145,12],[145,13,145,15],[145,17,145,18],[145,19,145,26],[145,27,145,29],[144,3,144,4],[144,5,144,12],[144,13,144,15],[144,17,144,18],[144,19,144,26],[144,27,144,29],[143,3,143,4],[143,5,143,12],[143,13,143,15],[143,17,143,18],[143,19,143,26],[143,27,143,29],[142,3,142,4],[142,5,142,12],[142,13,142,15],[142,17,142,18],[142,19,142,26],[142,27,142,29],[141,3,141,4],[141,5,141,12],[141,13,141,15],[141,17,141,18],[141,19,141,26],[141,27,141,29],[140,3,140,4],[140,5,140,12],[140,13,140,15],[140,17,140,18],[140,19,140,26],[140,27,140,29],[139,3,139,4],[139,5,139,12],[139,13,139,15],[139,17,139,18],[139,19,139,26],[139,27,139,29],[138,3,138,4],[138,5,138,12],[138,13,138,15],[138,17,138,18],[138,19,138,26],[138,27,138,29],[137,3,137,4],[137,5,137,12],[137,13,137,15],[137,17,137,18],[137,19,137,26],[137,27,137,29],[136,3,136,4],[136,5,136,12],[136,13,136,15],[136,17,136,18],[136,19,136,26],[136,27,136,29],[135,3,135,4],[135,5,135,12],[135,13,135,15],[135,17,135,18],[135,19,135,26],[135,27,135,29],[134,3,134,4],[134,5,134,12],[134,13,134,15],[134,17,134,18],[134,19,134,26],[134,27,134,29]],"merged_total":1729,"flags":["merged_cut"]}
[null,"CENSO NACIONAL DE GOBIERNOS\nESTATALES 2026",null,null,null,null,null,null,null,null,null,null,null,null,null,null,null,null,null,null,null,null,null,null,null,null,null,null,null,null,null,null,{"$f":"IF(CNGE_2026_M6_Secc2_Sub4!C189<>\"\",IF(AG10<>570,1,0),0)","v":0},{"$f":"IF(AI10<=AG15,0,1)","v":0}]
[]
[null,"Módulo 6. \nCatastro, registro y territorio"]
[]
[null,"Sección II. Registro Público de la Propiedad",null,null,null,null,null,null,null,null,null,null,null,null,null,null,null,null,null,null,null,null,null,null,null,null,null,null,null,null,null,null,{"$f":"SUM(N16)","v":0}]
[]
[null,"Complemento 1"]
[]
[null,"Entidad:",null,null,null,null,null,null,null,null,null,null,null,"Clave:",null,null,null,null,null,null,null,null,null,null,null,null,"Índice"]
[null,{"$f":"IF(Índice!B9=\"\",\"\",Índice!B9)","v":""},null,null,null,null,null,null,null,null,null,null,null,{"$f":"IF(Índice!N9=\"\",\"\",Índice!N9)","v":""},null,null,null,null,null,null,null,null,null,null,null,null,null,null,null,null,null,null,{"$f":"(COUNTBLANK(F16:F301)+COUNTBLANK(T16:T300)+COUNTBLANK(N16:N301)+COUNTBLANK(AB16:AB300)-(570-(AG12*2)))","v":572},null,{"$f":"SUM(N16:P301,AB16:AD300)","v":0}]
[]
[null,null,"Esta tabla corresponde a la pregunta 2.32 \"Cantidad de bienes inmuebles vigentes por municipio/demarcación territorial\". Si tuvo bienes inmuebles vigentes inscritos de los cuales desconoce a que municipio pertenecen, utilice la clasificación \"Sin municipio identificado\" para registrar la cantidad de estos.",null,null,null,null,null,null,null,null,null,null,null,null,null,null,null,null,null,null,null,null,null,null,null,null,null,null,null,null,null,{"$f":"CNGE_2026_M6_Secc2_Sub4!AG12","v":0}]
[]
[null,null,"Cantidad de bienes inmuebles vigentes por municipio/demarcación territorial"]
[null,null,"No","Clave",null,"Municipio/\ndemarcación territorial",null,null,null,null,null,null,null,"Cantidad de bienes inmuebles vigentes",null,null,"No","Clave",null,"Municipio/\ndemarcación territorial",null,null,null,null,null,null,null,"Cantidad de bienes inmuebles vigentes",null,null,null,null,{"$f":"CNGE_2026_M6_Secc2_Sub4!C189","v":0}]
[null,null,"1.",{"$f":"IF(ISBLANK(F16),\"\",VLOOKUP(F16,INDIRECT(CONCATENATE(\"LC_\",RIGHT($N$10,2))),2,FALSE))","v":""},null,null,null,null,null,null,null,null,null,null,null,null,"287.",{"$f":"IF(ISBLANK(T16),\"\",VLOOKUP(T16,INDIRECT(CONCATENATE(\"LC_\",RIGHT($N$10,2))),2,FALSE))","v":""}]
[null,null,"2.",{"$f":"IF(ISBLANK(F17),\"\",VLOOKUP(F17,INDIRECT(CONCATENATE(\"LC_\",RIGHT($N$10,2))),2,FALSE))","v":""},null,null,null,null,null,null,null,null,null,null,null,null,"288.",{"$f":"IF(ISBLANK(T17),\"\",VLOOKUP(T17,INDIRECT(CONCATENATE(\"LC_\",RIGHT($N$10,2))),2,FALSE))","v":""}]
[null,null,"3.",{"$f":"IF(ISBLANK(F18),\"\",VLOOKUP(F18,INDIRECT(CONCATENATE(\"LC_\",RIGHT($N$10,2))),2,FALSE))","v":""},null,null,null,null,null,null,null,null,null,null,null,null,"289.",""]
[null,null,"4.","",null,null,null,null,null,null,null,null,null,null,null,null,"290.",""]
[null,null,"5.","",null,null,null,null,null,null,null,null,null,null,null,null,"291.",""]
[null,null,"6.","",null,null,null,null,null,null,null,null,null,null,null,null,"292.",""]
[null,null,"7.","",null,null,null,null,null,null,null,null,null,null,null,null,"293.",""]
[null,null,"8.","",null,null,null,null,null,null,null,null,null,null,null,null,"294.",""]
[null,null,"9.","",null,null,null,null,null,null,null,null,null,null,null,null,"295",""]
[null,null,"10.","",null,null,null,null,null,null,null,null,null,null,null,null,"296.",""]
[null,null,"11.","",null,null,null,null,null,null,null,null,null,null,null,null,"297.",""]
[null,null,"12.","",null,null,null,null,null,null,null,null,null,null,null,null,"298.",""]
[null,null,"13.","",null,null,null,null,null,null,null,null,null,null,null,null,"299.",""]
[null,null,"14.","",null,null,null,null,null,null,null,null,null,null,null,null,"300.",""]
[null,null,"15.","",null,null,null,null,null,null,null,null,null,null,null,null,"301.",""]
[null,null,"16.","",null,null,null,null,null,null,null,null,null,null,null,null,"302.",""]
[null,null,"17.","",null,null,null,null,null,null,null,null,null,null,null,null,"303.",""]
[null,null,"18.","",null,null,null,null,null,null,null,null,null,null,null,null,"304.",""]
[null,null,"19.","",null,null,null,null,null,null,null,null,null,null,null,null,"305.",""]
[null,null,"20.","",null,null,null,null,null,null,null,null,null,null,null,null,"306.",""]
[null,null,"21.","",null,null,null,null,null,null,null,null,null,null,null,null,"307.",""]
[null,null,"22.","",null,null,null,null,null,null,null,null,null,null,null,null,"308.",""]
[null,null,"23.","",null,null,null,null,null,null,null,null,null,null,null,null,"309.",""]
[null,null,"24.","",null,null,null,null,null,null,null,null,null,null,null,null,"310.",""]
[null,null,"25.","",null,null,null,null,null,null,null,null,null,null,null,null,"311.",""]
[null,null,"26.","",null,null,null,null,null,null,null,null,null,null,null,null,"312.",""]
[null,null,"27.","",null,null,null,null,null,null,null,null,null,null,null,null,"313.",""]
[null,null,"28.","",null,null,null,null,null,null,null,null,null,null,null,null,"314.",""]
[null,null,"29.","",null,null,null,null,null,null,null,null,null,null,null,null,"315.",""]
[null,null,"30.","",null,null,null,null,null,null,null,null,null,null,null,null,"316.",""]
[null,null,"31.","",null,null,null,null,null,null,null,null,null,null,null,null,"317.",""]
[null,null,"32.","",null,null,null,null,null,null,null,null,null,null,null,null,"318.",""]
[null,null,"33.","",null,null,null,null,null,null,null,null,null,null,null,null,"319.",""]
[null,null,"34.","",null,null,null,null,null,null,null,null,null,null,null,null,"320.",""]
[null,null,"35.","",null,null,null,null,null,null,null,null,null,null,null,null,"321.",""]
[null,null,"36.","",null,null,null,null,null,null,null,null,null,null,null,null,"322.",""]
[null,null,"37.","",null,null,null,null,null,null,null,null,null,null,null,null,"323.",""]
[null,null,"38.","",null,null,null,null,null,null,null,null,null,null,null,null,"324.",""]
[null,null,"39.","",null,null,null,null,null,null,null,null,null,null,null,null,"325.",""]
[null,null,"40.","",null,null,null,null,null,null,null,null,null,null,null,null,"326.",""]
[null,null,"41.","",null,null,null,null,null,null,null,null,null,null,null,null,"327.",""]
[null,null,"42.","",null,null,null,null,null,null,null,null,null,null,null,null,"328.",""]
[null,null,"43.","",null,null,null,null,null,null,null,null,null,null,null,null,"329.",""]
[null,null,"44.","",null,null,null,null,null,null,null,null,null,null,null,null,"330.",""]
[null,null,"45.","",null,null,null,null,null,null,null,null,null,null,null,null,"331.",""]
[null,null,"46.","",null,null,null,null,null,null,null,null,null,null,null,null,"332.",""]
[null,null,"47.","",null,null,null,null,null,null,null,null,null,null,null,null,"333.",""]
[null,null,"48.","",null,null,null,null,null,null,null,null,null,null,null,null,"334.",""]
[null,null,"49.","",null,null,null,null,null,null,null,null,null,null,null,null,"335.",""]
[null,null,"50","",null,null,null,null,null,null,null,null,null,null,null,null,"336.",""]
[null,null,"51.","",null,null,null,null,null,null,null,null,null,null,null,null,"337.",""]
[null,null,"52.","",null,null,null,null,null,null,null,null,null,null,null,null,"338.",""]
[null,null,"53.","",null,null,null,null,null,null,null,null,null,null,null,null,"339.",""]
[null,null,"54.","",null,null,null,null,null,null,null,null,null,null,null,null,"340.",""]
[null,null,"55.","",null,null,null,null,null,null,null,null,null,null,null,null,"341.",""]
[null,null,"56.","",null,null,null,null,null,null,null,null,null,null,null,null,"342.",""]
[null,null,"57.","",null,null,null,null,null,null,null,null,null,null,null,null,"343.",""]
[null,null,"58.","",null,null,null,null,null,null,null,null,null,null,null,null,"344.",""]
[null,null,"59.","",null,null,null,null,null,null,null,null,null,null,null,null,"345.",""]
[null,null,"60.","",null,null,null,null,null,null,null,null,null,null,null,null,"346.",""]
[null,null,"61.","",null,null,null,null,null,null,null,null,null,null,null,null,"347.",""]
[null,null,"62.","",null,null,null,null,null,null,null,null,null,null,null,null,"348.",""]
[null,null,"63.","",null,null,null,null,null,null,null,null,null,null,null,null,"349.",""]
[null,null,"64.","",null,null,null,null,null,null,null,null,null,null,null,null,"350.",""]
[null,null,"65.","",null,null,null,null,null,null,null,null,null,null,null,null,"351.",""]
[null,null,"66.","",null,null,null,null,null,null,null,null,null,null,null,null,"352.",{"$f":"IF(ISBLANK(T81),\"\",VLOOKUP(T81,INDIRECT(CONCATENATE(\"LC_\",RIGHT($N$10,2))),2,FALSE))","v":""}]
[null,null,"67.",{"$f":"IF(ISBLANK(F82),\"\",VLOOKUP(F82,INDIRECT(CONCATENATE(\"LC_\",RIGHT($N$10,2))),2,FALSE))","v":""},null,null,null,null,null,null,null,null,null,null,null,null,"353.",""]
[null,null,"68.","",null,null,null,null,null,null,null,null,null,null,null,null,"354.",""]
[null,null,"69.","",null,null,null,null,null,null,null,null,null,null,null,null,"355.",""]
[null,null,"70.","",null,null,null,null,null,null,null,null,null,null,null,null,"356.",""]
[null,null,"71.","",null,null,null,null,null,null,null,null,null,null,null,null,"357.",""]
[null,null,"72.","",null,null,null,null,null,null,null,null,null,null,null,null,"358.",""]
[null,null,"73.","",null,null,null,null,null,null,null,null,null,null,null,null,"359.",""]
[null,null,"74.","",null,null,null,null,null,null,null,null,null,null,null,null,"360.",""]
[null,null,"75.","",null,null,null,null,null,null,null,null,null,null,null,null,"361.",""]
[null,null,"76.","",null,null,null,null,null,null,null,null,null,null,null,null,"362.",""]
[null,null,"77.","",null,null,null,null,null,null,null,null,null,null,null,null,"363.",""]
[null,null,"78.","",null,null,null,null,null,null,null,null,null,null,null,null,"364.",""]
[null,null,"79.","",null,null,null,null,null,null,null,null,null,null,null,null,"365.",""]
[null,null,"80.","",null,null,null,null,null,null,null,null,null,null,null,null,"366.",""]
[null,null,"81.","",null,null,null,null,null,null,null,null,null,null,null,null,"367.",""]
[null,null,"82.","",null,null,null,null,null,null,null,null,null,null,null,null,"368.",""]
[null,null,"83.","",null,null,null,null,null,null,null,null,null,null,null,null,"369.",""]
[null,null,"84.","",null,null,null,null,null,null,null,null,null,null,null,null,"370.",""]
[null,null,"85.","",null,null,null,null,null,null,null,null,null,null,null,null,"371.",""]
[null,null,"86.","",null,null,null,null,null,null,null,null,null,null,null,null,"372.",""]
[null,null,"87.","",null,null,null,null,null,null,null,null,null,null,null,null,"373.",""]
[null,null,"88.","",null,null,null,null,null,null,null,null,null,null,null,null,"374.",""]
[null,null,"89.","",null,null,null,null,null,null,null,null,null,null,null,null,"375.",""]
[null,null,"90.","",null,null,null,null,null,null,null,null,null,null,null,null,"376.",""]
[null,null,"91.","",null,null,null,null,null,null,null,null,null,null,null,null,"377.",""]
[null,null,"92.","",null,null,null,null,null,null,null,null,null,null,null,null,"378.",""]
[null,null,"93.","",null,null,null,null,null,null,null,null,null,null,null,null,"379.",""]
[null,null,"94.","",null,null,null,null,null,null,null,null,null,null,null,null,"380.",""]
[null,null,"95.","",null,null,null,null,null,null,null,null,null,null,null,null,"381.",""]
[null,null,"96.","",null,null,null,null,null,null,null,null,null,null,null,null,"382.",""]
[null,null,"97.","",null,null,null,null,null,null,null,null,null,null,null,null,"383.",""]
[null,null,"98.","",null,null,null,null,null,null,null,null,null,null,null,null,"384.",""]
[null,null,"99.","",null,null,null,null,null,null,null,null,null,null,null,null,"385.",""]
[null,null,"100.","",null,null,null,null,null,null,null,null,null,null,null,null,"386.",""]
[null,null,"101.","",null,null,null,null,null,null,null,null,null,null,null,null,"387.",""]
[null,null,"102.","",null,null,null,null,null,null,null,null,null,null,null,null,"388.",""]
[null,null,"103.","",null,null,null,null,null,null,null,null,null,null,null,null,"389.",""]
[null,null,"104.","",null,null,null,null,null,null,null,null,null,null,null,null,"390.",""]
[null,null,"105.","",null,null,null,null,null,null,null,null,null,null,null,null,"391.",""]
[null,null,"106.","",null,null,null,null,null,null,null,null,null,null,null,null,"392.",""]
[null,null,"107.","",null,null,null,null,null,null,null,null,null,null,null,null,"393.",""]
[null,null,"108","",null,null,null,null,null,null,null,null,null,null,null,null,"394.",""]
[null,null,"109.","",null,null,null,null,null,null,null,null,null,null,null,null,"395.",""]
[null,null,"110.","",null,null,null,null,null,null,null,null,null,null,null,null,"396.",""]
[null,null,"111.","",null,null,null,null,null,null,null,null,null,null,null,null,"397.",""]
[null,null,"112.","",null,null,null,null,null,null,null,null,null,null,null,null,"398.",""]
[null,null,"113.","",null,null,null,null,null,null,null,null,null,null,null,null,"399.",""]
[null,null,"114.","",null,null,null,null,null,null,null,null,null,null,null,null,"400.",""]
[null,null,"115.","",null,null,null,null,null,null,null,null,null,null,null,null,"401.",""]
[null,null,"116.","",null,null,null,null,null,null,null,null,null,null,null,null,"402.",""]
[null,null,"117.","",null,null,null,null,null,null,null,null,null,null,null,null,"403.",""]
[null,null,"118.","",null,null,null,null,null,null,null,null,null,null,null,null,"404.",""]
[null,null,"119.","",null,null,null,null,null,null,null,null,null,null,null,null,"405.",""]
[null,null,"120.","",null,null,null,null,null,null,null,null,null,null,null,null,"406.",""]
[null,null,"121.","",null,null,null,null,null,null,null,null,null,null,null,null,"407.",""]
[null,null,"122.","",null,null,null,null,null,null,null,null,null,null,null,null,"408.",""]
[null,null,"123.","",null,null,null,null,null,null,null,null,null,null,null,null,"409.",""]
[null,null,"124.","",null,null,null,null,null,null,null,null,null,null,null,null,"410.",""]
[null,null,"125.","",null,null,null,null,null,null,null,null,null,null,null,null,"411.",""]
[null,null,"126.","",null,null,null,null,null,null,null,null,null,null,null,null,"412.",""]
[null,null,"127.","",null,null,null,null,null,null,null,null,null,null,null,null,"413.",""]
[null,null,"128.","",null,null,null,null,null,null,null,null,null,null,null,null,"414.",""]
[null,null,"129.","",null,null,null,null,null,null,null,null,null,null,null,null,"415.",""]
[null,null,"130.","",null,null,null,null,null,null,null,null,null,null,null,null,"416.",{"$f":"IF(ISBLANK(T145),\"\",VLOOKUP(T145,INDIRECT(CONCATENATE(\"LC_\",RIGHT($N$10,2))),2,FALSE))","v":""}]
[null,null,"131.",{"$f":"IF(ISBLANK(F146),\"\",VLOOKUP(F146,INDIRECT(CONCATENATE(\"LC_\",RIGHT($N$10,2))),2,FALSE))","v":""},null,null,null,null,null,null,null,null,null,null,null,null,"417.",""]
[null,null,"132.","",null,null,null,null,null,null,null,null,null,null,null,null,"418.",""]
[null,null,"133.","",null,null,null,null,null,null,null,null,null,null,null,null,"419.",""]
[null,null,"134.","",null,null,null,null,null,null,null,null,null,null,null,null,"420.",""]
[null,null,"135.","",null,null,null,null,null,null,null,null,null,null,null,null,"421.",""]
[null,null,"136.","",null,null,null,null,null,null,null,null,null,null,null,null,"422.",""]
[null,null,"137.","",null,null,null,null,null,null,null,null,null,null,null,null,"423.",""]
[null,null,"138.","",null,null,null,null,null,null,null,null,null,null,null,null,"424.",""]
[null,null,"139.","",null,null,null,null,null,null,null,null,null,null,null,null,"425.",""]
[null,null,"140.","",null,null,null,null,null,null,null,null,null,null,null,null,"426.",""]
[null,null,"141.","",null,null,null,null,null,null,null,null,null,null,null,null,"427.",""]
[null,null,"142.","",null,null,null,null,null,null,null,null,null,null,null,null,"428.",""]
[null,null,"143.","",null,null,null,null,null,null,null,null,null,null,null,null,"429.",""]
[null,null,"144.","",null,null,null,null,null,null,null,null,null,null,null,null,"430.",""]
[null,null,"145.","",null,null,null,null,null,null,null,null,null,null,null,null,"431.",""]
[null,null,"146.","",null,null,null,null,null,null,null,null,null,null,null,null,"432.",""]
[null,null,"147.","",null,null,null,null,null,null,null,null,null,null,null,null,"433.",""]
[null,null,"148.","",null,null,null,null,null,null,null,null,null,null,null,null,"434.",""]
[null,null,"149.","",null,null,null,null,null,null,null,null,null,null,null,null,"435.",""]
[null,null,"150.","",null,null,null,null,null,null,null,null,null,null,null,null,"436.",""]
[null,null,"151.","",null,null,null,null,null,null,null,null,null,null,null,null,"437.",""]
[null,null,"152.","",null,null,null,null,null,null,null,null,null,null,null,null,"438.",""]
[null,null,"153.","",null,null,null,null,null,null,null,null,null,null,null,null,"439.",""]
[null,null,"154.","",null,null,null,null,null,null,null,null,null,null,null,null,"440.",""]
[null,null,"155.","",null,null,null,null,null,null,null,null,null,null,null,null,"441.",""]
[null,null,"156.","",null,null,null,null,null,null,null,null,null,null,null,null,"442.",""]
[null,null,"157.","",null,null,null,null,null,null,null,null,null,null,null,null,"443.",""]
[null,null,"158.","",null,null,null,null,null,null,null,null,null,null,null,null,"444.",""]
[null,null,"159.","",null,null,null,null,null,null,null,null,null,null,null,null,"445.",""]
[null,null,"160.","",null,null,null,null,null,null,null,null,null,null,null,null,"446.",""]
[null,null,"161.","",null,null,null,null,null,null,null,null,null,null,null,null,"447.",""]
[null,null,"162.","",null,null,null,null,null,null,null,null,null,null,null,null,"448.",""]
[null,null,"163.","",null,null,null,null,null,null,null,null,null,null,null,null,"449.",""]
[null,null,"164.","",null,null,null,null,null,null,null,null,null,null,null,null,"450.",""]
[null,null,"165.","",null,null,null,null,null,null,null,null,null,null,null,null,"451.",""]
[null,null,"166.","",null,null,null,null,null,null,null,null,null,null,null,null,"452.",""]
[null,null,"167.","",null,null,null,null,null,null,null,null,null,null,null,null,"453.",""]
[null,null,"168.","",null,null,null,null,null,null,null,null,null,null,null,null,"454.",""]
[null,null,"169.","",null,null,null,null,null,null,null,null,null,null,null,null,"455.",""]
[null,null,"170.","",null,null,null,null,null,null,null,null,null,null,null,null,"456.",""]
[null,null,"171.","",null,null,null,null,null,null,null,null,null,null,null,null,"457.",""]
[null,null,"172.","",null,null,null,null,null,null,null,null,null,null,null,null,"458.",""]
[null,null,"173.","",null,null,null,null,null,null,null,null,null,null,null,null,"459.",""]
[null,null,"174.","",null,null,null,null,null,null,null,null,null,null,null,null,"460.",""]
[null,null,"175.","",null,null,null,null,null,null,null,null,null,null,null,null,"461.",""]
[null,null,"176.","",null,null,null,null,null,null,null,null,null,null,null,null,"462.",""]
[null,null,"177.","",null,null,null,null,null,null,null,null,null,null,null,null,"463.",""]
[null,null,"178.","",null,null,null,null,null,null,null,null,null,null,null,null,"464.",""]
[null,null,"179.","",null,null,null,null,null,null,null,null,null,null,null,null,"465.",""]
[null,null,"180.","",null,null,null,null,null,null,null,null,null,null,null,null,"466.",""]
[null,null,"181.","",null,null,null,null,null,null,null,null,null,null,null,null,"467.",""]
[null,null,"182.","",null,null,null,null,null,null,null,null,null,null,null,null,"468.",""]
[null,null,"183.","",null,null,null,null,null,null,null,null,null,null,null,null,"469.",""]
[null,null,"184.","",null,null,null,null,null,null,null,null,null,null,null,null,"470.",""]
[null,null,"185.","",null,null,null,null,null,null,null,null,null,null,null,null,"471.",""]
[null,null,"186.","",null,null,null,null,null,null,null,null,null,null,null,null,"472.",""]
[null,null,"187.","",null,null,null,null,null,null,null,null,null,null,null,null,"473.",""]
[null,null,"188.","",null,null,null,null,null,null,null,null,null,null,null,null,"474.",""]
[null,null,"189.","",null,null,null,null,null,null,null,null,null,null,null,null,"475.",""]
[null,null,"190.","",null,null,null,null,null,null,null,null,null,null,null,null,"476.",""]
[null,null,"191.","",null,null,null,null,null,null,null,null,null,null,null,null,"477.",""]
[null,null,"192.","",null,null,null,null,null,null,null,null,null,null,null,null,"478.",""]
[null,null,"193.","",null,null,null,null,null,null,null,null,null,null,null,null,"479.",""]
[null,null,"194.","",null,null,null,null,null,null,null,null,null,null,null,null,"480.",{"$f":"IF(ISBLANK(T209),\"\",VLOOKUP(T209,INDIRECT(CONCATENATE(\"LC_\",RIGHT($N$10,2))),2,FALSE))","v":""}]
[null,null,"195.",{"$f":"IF(ISBLANK(F210),\"\",VLOOKUP(F210,INDIRECT(CONCATENATE(\"LC_\",RIGHT($N$10,2))),2,FALSE))","v":""},null,null,null,null,null,null,null,null,null,null,null,null,"481.",""]
[null,null,"196.","",null,null,null,null,null,null,null,null,null,null,null,null,"482.",""]
[null,null,"197.","",null,null,null,null,null,null,null,null,null,null,null,null,"483.",""]
[null,null,"198.","",null,null,null,null,null,null,null,null,null,null,null,null,"484.",""]
[null,null,"199.","",null,null,null,null,null,null,null,null,null,null,null,null,"485.",""]
[null,null,"200.","",null,null,null,null,null,null,null,null,null,null,null,null,"486.",""]
[null,null,"201.","",null,null,null,null,null,null,null,null,null,null,null,null,"487.",""]
[null,null,"202.","",null,null,null,null,null,null,null,null,null,null,null,null,"488.",""]
[null,null,"203.","",null,null,null,null,null,null,null,null,null,null,null,null,"489.",""]
[null,null,"204.","",null,null,null,null,null,null,null,null,null,null,null,null,"490.",""]
[null,null,"205.","",null,null,null,null,null,null,null,null,null,null,null,null,"491.",""]
[null,null,"206.","",null,null,null,null,null,null,null,null,null,null,null,null,"492.",""]
[null,null,"207.","",null,null,null,null,null,null,null,null,null,null,null,null,"493.",""]
[null,null,"208.","",null,null,null,null,null,null,null,null,null,null,null,null,"494.",""]
[null,null,"209.","",null,null,null,null,null,null,null,null,null,null,null,null,"495.",""]
[null,null,"210.","",null,null,null,null,null,null,null,null,null,null,null,null,"496.",""]
[null,null,"211.","",null,null,null,null,null,null,null,null,null,null,null,null,"497.",""]
[null,null,"212.","",null,null,null,null,null,null,null,null,null,null,null,null,"498.",""]
[null,null,"213.","",null,null,null,null,null,null,null,null,null,null,null,null,"499.",""]
[null,null,"214.","",null,null,null,null,null,null,null,null,null,null,null,null,"500.",""]
[null,null,"215.","",null,null,null,null,null,null,null,null,null,null,null,null,"501.",""]
[null,null,"216.","",null,null,null,null,null,null,null,null,null,null,null,null,"502.",""]
[null,null,"217.","",null,null,null,null,null,null,null,null,null,null,null,null,"503.",""]
[null,null,"218.","",null,null,null,null,null,null,null,null,null,null,null,null,"504.",""]
[null,null,"219.","",null,null,null,null,null,null,null,null,null,null,null,null,"505.",""]
[null,null,"220.","",null,null,null,null,null,null,null,null,null,null,null,null,"506.",""]
[null,null,"221.","",null,null,null,null,null,null,null,null,null,null,null,null,"507.",""]
[null,null,"222.","",null,null,null,null,null,null,null,null,null,null,null,null,"508.",""]
[null,null,"223.","",null,null,null,null,null,null,null,null,null,null,null,null,"509.",""]
[null,null,"224.","",null,null,null,null,null,null,null,null,null,null,null,null,"510.",""]
[null,null,"225.","",null,null,null,null,null,null,null,null,null,null,null,null,"511.",""]
[null,null,"226.","",null,null,null,null,null,null,null,null,null,null,null,null,"512.",""]
[null,null,"227.","",null,null,null,null,null,null,null,null,null,null,null,null,"513.",""]
[null,null,"228.","",null,null,null,null,null,null,null,null,null,null,null,null,"514.",""]
[null,null,"229.","",null,null,null,null,null,null,null,null,null,null,null,null,"515.",""]
[null,null,"230.","",null,null,null,null,null,null,null,null,null,null,null,null,"516.",""]
[null,null,"231.","",null,null,null,null,null,null,null,null,null,null,null,null,"517.",""]
[null,null,"232.","",null,null,null,null,null,null,null,null,null,null,null,null,"518.",""]
[null,null,"233.","",null,null,null,null,null,null,null,null,null,null,null,null,"519.",""]
[null,null,"234.","",null,null,null,null,null,null,null,null,null,null,null,null,"520.",""]
[null,null,"235.","",null,null,null,null,null,null,null,null,null,null,null,null,"521.",""]
[null,null,"236.","",null,null,null,null,null,null,null,null,null,null,null,null,"522.",""]
[null,null,"237.","",null,null,null,null,null,null,null,null,null,null,null,null,"523.",""]
[null,null,"238.","",null,null,null,null,null,null,null,null,null,null,null,null,"524.",""]
[null,null,"239.","",null,null,null,null,null,null,null,null,null,null,null,null,"525.",""]
[null,null,"240.","",null,null,null,null,null,null,null,null,null,null,null,null,"526.",""]
[null,null,"241.","",null,null,null,null,null,null,null,null,null,null,null,null,"527.",""]
[null,null,"242.","",null,null,null,null,null,null,null,null,null,null,null,null,"528.",""]
[null,null,"243.","",null,null,null,null,null,null,null,null,null,null,null,null,"529.",""]
[null,null,"244.","",null,null,null,null,null,null,null,null,null,null,null,null,"530.",""]
[null,null,"245.","",null,null,null,null,null,null,null,null,null,null,null,null,"531.",""]
[null,null,"246.","",null,null,null,null,null,null,null,null,null,null,null,null,"532.",""]
[null,null,"247.","",null,null,null,null,null,null,null,null,null,null,null,null,"533.",""]
[null,null,"248.","",null,null,null,null,null,null,null,null,null,null,null,null,"534.",""]
[null,null,"249.","",null,null,null,null,null,null,null,null,null,null,null,null,"535.",""]
[null,null,"250.","",null,null,null,null,null,null,null,null,null,null,null,null,"536.",""]
[null,null,"251.","",null,null,null,null,null,null,null,null,null,null,null,null,"537.",""]
[null,null,"252.","",null,null,null,null,null,null,null,null,null,null,null,null,"538.",""]
[null,null,"253.","",null,null,null,null,null,null,null,null,null,null,null,null,"539.",""]
[null,null,"254.","",null,null,null,null,null,null,null,null,null,null,null,null,"540.",""]
[null,null,"255.","",null,null,null,null,null,null,null,null,null,null,null,null,"541.",""]
[null,null,"256.","",null,null,null,null,null,null,null,null,null,null,null,null,"542.",""]
[null,null,"257.","",null,null,null,null,null,null,null,null,null,null,null,null,"543.",""]
[null,null,"258.","",null,null,null,null,null,null,null,null,null,null,null,null,"544.",{"$f":"IF(ISBLANK(T273),\"\",VLOOKUP(T273,INDIRECT(CONCATENATE(\"LC_\",RIGHT($N$10,2))),2,FALSE))","v":""}]
[null,null,"259.",{"$f":"IF(ISBLANK(F274),\"\",VLOOKUP(F274,INDIRECT(CONCATENATE(\"LC_\",RIGHT($N$10,2))),2,FALSE))","v":""},null,null,null,null,null,null,null,null,null,null,null,null,"545.",""]
[null,null,"260.","",null,null,null,null,null,null,null,null,null,null,null,null,"546.",""]
[null,null,"261.","",null,null,null,null,null,null,null,null,null,null,null,null,"547.",""]
[null,null,"262.","",null,null,null,null,null,null,null,null,null,null,null,null,"548.",""]
[null,null,"263.","",null,null,null,null,null,null,null,null,null,null,null,null,"549.",""]
[null,null,"264.","",null,null,null,null,null,null,null,null,null,null,null,null,"550.",""]
[null,null,"265.","",null,null,null,null,null,null,null,null,null,null,null,null,"551.",""]
[null,null,"266.","",null,null,null,null,null,null,null,null,null,null,null,null,"552.",""]
[null,null,"267.","",null,null,null,null,null,null,null,null,null,null,null,null,"553.",""]
[null,null,"268.","",null,null,null,null,null,null,null,null,null,null,null,null,"554.",""]
[null,null,"269.","",null,null,null,null,null,null,null,null,null,null,null,null,"555.",""]
[null,null,"270.","",null,null,null,null,null,null,null,null,null,null,null,null,"556.",""]
[null,null,"271.","",null,null,null,null,null,null,null,null,null,null,null,null,"557.",""]
[null,null,"272.","",null,null,null,null,null,null,null,null,null,null,null,null,"558.",""]
[null,null,"273.","",null,null,null,null,null,null,null,null,null,null,null,null,"559.",""]
[null,null,"274.","",null,null,null,null,null,null,null,null,null,null,null,null,"560.",""]
[null,null,"275.","",null,null,null,null,null,null,null,null,null,null,null,null,"561.",""]
[null,null,"276.","",null,null,null,null,null,null,null,null,null,null,null,null,"562.",""]
[null,null,"277.","",null,null,null,null,null,null,null,null,null,null,null,null,"563.",""]
[null,null,"278.","",null,null,null,null,null,null,null,null,null,null,null,null,"564.",""]
[null,null,"279.","",null,null,null,null,null,null,null,null,null,null,null,null,"565.",""]
[null,null,"280.","",null,null,null,null,null,null,null,null,null,null,null,null,"566.",""]
[null,null,"281.","",null,null,null,null,null,null,null,null,null,null,null,null,"567.",""]
[null,null,"282.","",null,null,null,null,null,null,null,null,null,null,null,null,"568.",""]
[null,null,"283.","",null,null,null,null,null,null,null,null,null,null,null,null,"569.",""]
[null,null,"284.","",null,null,null,null,null,null,null,null,null,null,null,null,"570.",""]
[null,null,"285.","",null,null,null,null,null,null,null,null,null,null,null,null,null,""]
[null,null,"286.",""]

{"sheet":"Glosario","index":13,"n_rows":339,"n_cols":27,"rows_kept":339,"cut":false,"hidden":true,"merged":[[338,2,338,29],[324,3,324,29],[326,3,326,29],[328,3,328,29],[330,3,330,29],[332,3,332,29],[335,2,335,29],[312,3,312,29],[314,3,314,29],[316,3,316,29],[318,3,318,29],[320,3,320,29],[322,3,322,29],[295,2,295,29],[298,2,298,29],[301,2,301,29],[304,2,304,29],[307,2,307,29],[310,2,310,29],[280,2,280,29],[283,2,283,29],[286,2,286,29],[289,2,289,29],[291,3,291,30],[292,2,292,29],[265,3,265,29],[267,3,267,29],[269,3,269,29],[271,3,271,29],[274,2,274,29],[277,2,277,29],[253,3,253,29],[255,3,255,29],[257,3,257,29],[259,3,259,29],[261,3,261,29],[263,3,263,29],[241,3,241,29],[243,3,243,29],[245,3,245,29],[247,3,247,29],[249,3,249,29],[251,3,251,29],[228,2,228,29],[231,2,231,29],[233,3,233,29],[235,3,235,29],[237,3,237,29],[239,3,239,29],[213,2,213,29],[216,2,216,29],[218,1,218,29],[219,2,219,29],[222,2,222,29],[225,2,225,29],[195,2,195,29],[198,2,198,29],[201,2,201,29],[204,2,204,29],[207,2,207,29],[210,2,210,29],[177,2,177,29],[180,2,180,29],[183,2,183,29],[186,2,186,29],[189,2,189,29],[192,2,192,29],[160,3,160,29],[162,3,162,29],[165,2,165,29],[168,2,168,29],[171,2,171,29],[174,2,174,29],[148,3,148,29],[150,3,150,29],[152,3,152,29],[154,3,154,29],[156,3,156,29],[158,3,158,29],[134,3,134,29],[136,3,136,29],[138,3,138,29],[140,3,140,29],[143,2,143,29],[146,2,146,29],[120,2,120,29],[123,2,123,29],[126,2,126,29],[128,3,128,29],[130,3,130,29],[132,3,132,29],[102,2,102,29],[105,2,105,29],[108,2,108,29],[111,2,111,29],[114,2,114,29],[117,2,117,29],[88,3,88,29],[90,3,90,29],[92,3,92,29],[95,2,95,29],[97,3,97,29],[99,3,99,29],[73,3,73,29],[75,3,75,29],[77,3,77,29],[80,2,80,29],[83,2,83,29],[86,2,86,29],[59,2,59,29],[62,2,62,29],[65,2,65,29],[67,3,67,29],[69,3,69,29],[71,3,71,29],[41,2,41,29],[44,2,44,29],[47,2,47,29],[50,2,50,29],[53,2,53,29],[56,2,56,29],[29,3,29,29],[32,2,32,29],[35,2,35,29],[38,2,38,29],[12,2,12,29],[15,2,15,29],[17,3,17,29],[19,3,19,29],[21,3,21,29],[23,3,23,29],[0,1,0,29],[2,1,2,29],[4,1,4,29],[6,1,6,29],[8,26,8,29],[9,1,9,11],[9,13,9,14],[25,3,25,29],[27,3,27,29]]}
[null,"CENSO NACIONAL DE GOBIERNOS\nESTATALES 2026"]
[]
[null,"Módulo 6.\nCatastro, registro y territorio"]
[]
[null,"Sección II. Registro Público de la Propiedad"]
[]
[null,"Glosario"]
[]
[null,"Entidad:",null,null,null,null,null,null,null,null,null,null,null,"Clave:",null,null,null,null,null,null,null,null,null,null,null,null,"Índice"]
[null,{"$f":"IF(Índice!B9=\"\",\"\",Índice!B9)","v":""},null,null,null,null,null,null,null,null,null,null,null,{"$f":"IF(Índice!N9=\"\",\"\",Índice!N9)","v":""}]
[]
[null,"Acervo registral"]
[null,null,"Se refiere al conjunto de libros y documentos físicos y electrónicos existentes en las oficinas registrales, los cuales dan sustento a los asientos existentes en el mismo, y que requieren del resguardo por parte del Estado en función de su valor, tanto histórico como de consulta. "]
[]
[null,"Actividades que son susceptibles de registro o inscripción"]
[null,null,"Se refiere a los tipos de actividades que, consignadas en actos o contratos, al ser inscritos en la institución registral, producirán efectos declarativos o constitutivos. Para efectos del censo se definirán los siguientes tipos de actividades:"]
[]
[null,null,null,"Desarrollo urbano: Se refiere a la acción urbanística que consiste en los actos o actividades tendientes al uso o aprovechamiento del suelo dentro de áreas urbanizadas o urbanizables, tales como: subdivisiones, parcelaciones, fusiones, relotificaciones, fraccionamientos, condominios, conjuntos urbanos o urbanizaciones en general, así como de construcción, ampliación, remodelación, reparación, demolición o reconstrucción de inmuebles, de propiedad pública o privada, que por su naturaleza están determinadas en los planes o programas de desarrollo urbano o tienen los permisos correspondientes. Comprende también la realización de obras de equipamiento, infraestructura o servicios urbanos. \n\nEn la institución registral, se inscribirán los planes y programas estatales de desarrollo urbano, así como los planes y programas municipales en materia de desarrollo urbano, reservas, usos del suelo y destinos de áreas y predios, cuando éstos tengan congruencia y estén ajustados con la planeación estatal y federal. Asimismo, se inscribirán los planes o programas de centros de población y los derivados de estos."]
[]
[null,null,null,"Inmobiliaria: Se refiere a todos aquellos actos que inciden sobre bienes inmuebles. Se consideran bienes inmuebles: \n\nI. El suelo y las construcciones adheridas a él;\nII. Las plantas y árboles, mientras estuvieren unidos a la tierra, y los frutos pendientes de los mismos árboles y plantas mientras no sean separados de ellos por cosechas o cortes regulares;\nIII. Todo lo que esté unido a un inmueble de una manera fija, de modo que no pueda separarse sin deterioro del mismo inmueble o del objeto a él adherido;\nIV. Las estatuas, relieves, pinturas u otros objetos de ornamentación, colocados en edificios o heredados por el dueño del inmueble, en tal forma que revele el propósito de unirlos de un modo permanente al fundo;\nV. Los palomares, colmenas, estanques de peces o criaderos análogos, cuando el propietario los conserve con el propósito de mantenerlos unidos a la finca y formando parte de ella de un modo permanente;\nVI. Las máquinas, vasos, instrumentos o utensilios destinados por el propietario de la finca directa y exclusivamente, a la industria o explotación de la misma;\nVII. Los abonos destinados al cultivo de una heredad, que estén en las tierras donde hayan de utilizarse, y las semillas necesarias para el cultivo de la finca;\nVIII. Los aparatos eléctricos y accesorios adheridos al suelo o a los edificios por el dueño de éstos, salvo convenio en contrario;\nIX. Los manantiales, estanques, aljibes y corrientes de agua, así como los acueductos y las cañerías de cualquiera especie que sirvan para conducir los líquidos o gases a una finca o para extraerlos de ella;\nX. Los animales que formen el pie de cría en los predios rústicos destinados total o parcialmente al ramo de ganadería; así como las bestias de trabajo indispensables en el cultivo de la finca, mientras están destinadas a ese objeto;\nXI. Los diques y construcciones que, aun cuando sean flotantes, estén destinados por su objeto y condiciones a permanecer en un punto fijo de un río, lago o costa;\nXII. Los derechos reales sobre inmuebles;\nXIII. Las líneas telefónicas y telegráficas y las estaciones radiotelegráficas fijas"]
[]
[null,null,null,"Mercantil: Se refiere a todos aquellos actos considerados como mercantiles o de comercio. Se consideran actos de comercio:\n\nI. Todas las adquisiciones, enajenaciones y alquileres verificados con propósito de especulación comercial, de mantenimientos, artículos, muebles o mercaderías, sea en estado natural, sea después de trabajados o labrados;\nII. Las compras y ventas de bienes inmuebles, cuando se hagan con dicho propósito de especulación comercial;\nIII. Las compras y ventas de porciones, acciones y obligaciones de las sociedades mercantiles;\nIV. Los contratos relativos y obligaciones del Estado ú otros títulos de crédito corrientes en el comercio;\nV. Las empresas de abastecimientos y suministros;\nVI. Las empresas de construcciones, y trabajos públicos y privados;\nVII. Las empresas de fábricas y manufacturas;\nVIII. Las empresas de trasportes de personas o cosas, por tierra o por agua; y las empresas de turismo.\nIX. Las librerías, y las empresas editoriales y tipográficas;\nX. Las empresas de comisiones, de agencias, de oficinas de negocios comerciales, casas de empeño y establecimientos de ventas en pública almoneda;\nXI. Las empresas de espectáculos públicos;\nXII. Las operaciones de comisión mercantil;\nXIII. Las operaciones de mediación de negocios mercantiles;\nXIV. Las operaciones de bancos;\nXV. Todos los contratos relativos al comercio marítimo y a la navegación interior y exterior;\nXVI. Los contratos de seguros de toda especie;\nXVII. Los depósitos por causa de comercio;\nXVIII. Los depósitos en los almacenes generales y todas las operaciones hechas sobre los certificados de depósito y bonos de prenda librados por los mismos;\nXIX. Los cheques, letras de cambio o remesas de dinero de una plaza a otra, entre toda clase de personas;\nXX. Los vales ú otros títulos a la orden o al portador, y las obligaciones de los comerciantes, a no ser que se pruebe que se derivan de una causa extraña al comercio;\nXXI. Las obligaciones entre comerciantes y banqueros, si no son de naturaleza esencialmente civil;\nXXII. Los contratos y obligaciones de los empleados de los comerciantes en lo que concierne al comercio del negociante que los tiene a su servicio;\nXXIII. La enajenación que el propietario o el cultivador hagan de los productos de su finca o de su cultivo;\nXXIV. Las operaciones contenidas en la Ley General de Títulos y Operaciones de Crédito;"]
[]
[null,null,null,"Mobiliaria: Se refiere a aquellos actos que inciden sobre bienes muebles. Los bienes son muebles por su naturaleza o por disposición de la ley.\n\nI. Son muebles por su naturaleza, los cuerpos que pueden trasladarse de un lugar a otro, ya se muevan por sí mismos, ya por efecto de una fuerza exterior. \nII. Son bienes muebles por determinación de la ley, las obligaciones y los derechos o acciones que tienen por objeto cosas muebles o cantidades exigibles en virtud de acción personal. \nIII. Por igual razón se reputan muebles las acciones que cada socio tiene en las asociaciones o sociedades, aun cuando a éstas pertenezcan algunos bienes inmuebles.\nIV. Las embarcaciones de todo género son bienes muebles. \nV. Los materiales procedentes de la demolición de un edificio, y los que se hubieren acopiado para repararlo o para construir uno nuevo, serán muebles mientras no se hayan empleado en la fabricación. \nVI. Los derechos de autor se consideran bienes muebles. \nVII. En general, son bienes muebles, todos los demás no considerados por la ley como inmuebles."]
[]
[null,null,null,"Notarial: Se refiere a la actividad ejercida por el notario, que es un profesional del derecho, investido de fe pública por el Estado, que brinda seguridad jurídica y certeza en los actos y hechos de los que da fe, manteniendo siempre un alto nivel de profesionalismo, total imparcialidad con los prestatarios del servicio y plena autonomía en sus decisiones, las cuales solo tienen por límite el marco jurídico y el Estado de Derecho.\n\nEl notario ejerce su función con independencia del poder público y los particulares. Es así como recibe, interpreta, redacta y da forma legal a la voluntad de los comparecientes al plasmarla en un instrumento público y auténtico, redactado bajo su responsabilidad y que puede ser una escritura pública, si se trata de dar fe de un acto jurídico; por ejemplo, un contrato; o bien un acta notarial, si se certifica un hecho jurídico o material, por ejemplo, una notificación o una fe de hechos.\n\nEl notario conserva y reproduce el instrumento, brindando así seguridad y tranquilidad a la sociedad. También auxilia a las autoridades locales y federales en el cálculo y cobro de impuestos y derechos; y vigila que se registren los actos que ante él se otorgan."]
[]
[null,null,null,"Personas morales de carácter civil: Se refiere a las personas morales, colectivas o jurídicas como aquellas entidades (normalmente grupos de individuos) a las cuales el derecho considera como una sola entidad para que actúe como tal en la vida jurídica. De forma específica, las personas morales tendrán naturaleza civil, si su objeto no es preponderantemente económico (asociaciones), o en caso de serlo, este no constituye una especulación comercial (sociedades)."]
[]
[null,null,null,"Testamentaria: Se refiere a aquellos actos que versan sobre las sucesiones. Se define a la herencia, como la sucesión en todos los bienes del difunto y en todos sus derechos y obligaciones que no se extinguen por la muerte. La herencia se defiere por la voluntad del testado o por disposición de la ley. La primera se llama testamentaria y la segunda, legítima.\n\nSe define al testamento como un acto personalísimo, revocable y libre, por el cual una persona capaz dispone de sus bienes y derechos, y declara o cumple deberes para después de su muerte."]
[]
[null,"Administración Pública Estatal Centralizada"]
[null,null,"Se refiere al conjunto de instituciones o dependencias de la Administración Pública de la entidad federativa que, de acuerdo con la ley orgánica respectiva, fueron creadas para el despacho de los negocios de orden administrativo encomendados al Poder Ejecutivo Estatal, tales como: la oficina del(a) Gobernador(a) u homóloga, las secretarías, la consejería jurídica u homóloga y las demás instituciones que la disposición normativa en la materia establezca."]
[]
[null,"Administración Pública Estatal Descentralizada"]
[null,null,"Se refiere a la entidad de la administración pública creada por ley o decreto del Congreso o por decreto del Ejecutivo estatal, con personalidad jurídica y patrimonio propio, cualquiera que sea la estructura legal que adopten, constituida con fondos o bienes provenientes de la administración pública estatal. Su objetivo es la prestación de un servicio público o social, la explotación de bienes o recursos propiedad del Estado."]
[]
[null,"Administración Pública Estatal Desconcentrada"]
[null,null,"Se refiere a las entidades jerárquicamente subordinadas a las instituciones, con facultades específicas para resolver asuntos en la materia encomendada de conformidad con las disposiciones legales aplicables. Los órganos desconcentrados cuentan con autonomía administrativa, pero no tienen responsabilidad jurídica ni patrimonio propio. Es importante señalar que los recursos ejercidos por los órganos administrativos desconcentrados forman parte del gasto del ramo administrativo que los coordina sectorialmente."]
[]
[null,"Alerta inmobiliaria"]
[null,null,"Se refiere al servicio mediante el cual, a través de dispositivos móviles, cuentas de correo electrónico u otros medios, se notifica de forma inmediata al titular registrado sobre cualquier tipo de consulta o movimiento que se lleve a cabo sobre su predio, a efecto de alertar sobre posibles modificaciones en su situación jurídica."]
[]
[null,"Anotación marginal"]
[null,null,"Se refiere a la referencia vinculatoria a otra inscripción que indica una situación jurídica con el bien o derecho que ampara dicha inscripción."]
[]
[null,"Anotación preventiva"]
[null,null,"Se refiere a las anotaciones que previenen a terceros sobre determinada circunstancia anotada y tienden a convertirse en definitivas o a quedar sin razón de ser por producirse los efectos para las cuales se solicitaron."]
[]
[null,"Cancelación de inscripción"]
[null,null,"Se refiere al acto a través del cual se anula y se deja sin efectos parcial o totalmente una anotación o una inscripción, por haberse transmitido o extinguido un derecho en todo o en parte."]
[]
[null,"Cancelaciones"]
[null,null,"Se refiere a las cancelaciones realizadas sobre las limitaciones existentes. Las inscripciones pueden cancelarse por consentimiento de las personas a cuyo favor estén hechas o por orden judicial. Podrán no obstante ser canceladas a petición de parte, sin dichos requisitos, cuando el derecho inscrito o anotado quede extinguido por disposición de la ley o por causas que resulten del título en cuya virtud se practicó la inscripción, debido a hecho que no requiera la intervención de la voluntad."]
[]
[null,"Capitulaciones matrimoniales"]
[null,null,"Se refiere a los pactos que los esposos celebran para constituir la sociedad conyugal o la separación de bienes y reglamentar la administración de estos en uno y en otro caso."]
[]
[null,"Catastro"]
[null,null,"Se refiere al inventario público, sistemáticamente organizado, gráfico y alfanumérico descriptivo de los bienes inmuebles urbanos, rurales y de características especiales de un país. Es el término empleado para designar una serie de registros que muestran la extensión, el valor y la propiedad (u otro fundamento del uso o de la ocupación) de la tierra."]
[]
[null,"Cédula única catastral y registral "]
[null,null,"Se refiere al documento electrónico oficial a utilizar por las instituciones catastrales y registrales, mismo que se constituye como la base fundamental para captar información estadística y geográfica para el SNIEG, la cual contiene los elementos mínimos obligatorios y opcionales que identifican aspectos jurídicos y técnicos de un predio para garantizar la asociación entre la información catastral y registral."]
[]
[null,"Certificación"]
[null,null,"Se refiere al acto a través del cual el registrador da fe de los actos o constancias inscritos en el folio o en el libro correspondiente, así como del contenido de los documentos de los archivos de la institución a su cargo. Para efectos del censo se definirán los siguientes certificados:"]
[]
[null,null,null,"Certificado de gravamen o libertad de gravamen: Se refiere a aquel en el que se hace constar la existencia de los gravámenes reales de una finca, tales como las hipotecas, prendas y servidumbres; o bien, aquel en el que se hace constar que una finca está libre de gravámenes reales.\t\t\t\t\t\t\t"]
[]
[null,null,null,"Certificado de historial registral: Se refiere a aquel que contiene la descripción de un inmueble, así como las anotaciones con que cuenta una inscripción y la relación de todos los antecedentes registrales, hasta la inscripción primordial."]
[]
[null,null,null,"Certificado de inscripción o no inscripción de predio: Se refiere a aquel que certifica que un bien inmueble determinado se encuentra inscrito en la institución registral; o bien, aquel en el que se hace constar que un bien inmueble determinado no se encuentra inscrito en la institución registral.\t\t\t\t\t\t"]
[]
[null,null,null,"Certificado de propiedad o no propiedad: Se refiere a aquel en el que se describen todos los predios pertenecientes a una persona física o moral; o bien, aquel en el que se hace constar que en los archivos de la institución registral no existe inscripción de bienes inmuebles a favor de determinada persona física o moral."]
[]
[null,null,null,"Certificado de única propiedad: Se refiere a aquel que se expide en específico sobre un bien inmueble, que resulta ser la única propiedad inscrita de una persona física o moral en una determinada institución registral."]
[]
[null,null,null,"Copias certificadas: Se refiere a la expedición de copias de inscripciones o de documentos agregados al apéndice, debidamente autentificados."]
[]
[null,"Clave catastral"]
[null,null,"Se refiere al código que identifica al predio de forma única para su localización geográfica, mismo que es asignado a cada uno de ellos en el momento de su inscripción en el padrón catastral por las Unidades del Estado con atribuciones catastrales."]
[]
[null,"CNGE 2026"]
[null,null,"Se refiere a las siglas con las que se identifica al Censo Nacional de Gobiernos Estatales 2026."]
[]
[null,"Convenios o contratos"]
[null,null,"Se refiere al acuerdo de dos o más personas para crear, transferir, modificar o extinguir obligaciones. Los convenios que producen o transfieren las obligaciones y derechos, toman el nombre de contratos. Para efectos del censo se definirán los siguientes convenios o contratos:"]
[]
[null,null,null,"Arrendamiento: Se refiere al contrato por medio del cual, las dos partes contratantes se obligan recíprocamente, una, a conceder el uso o goce temporal de un bien inmueble, y la otra, a pagar por ese uso o goce un precio cierto."]
[]
[null,null,null,"Comodato: Se refiere al contrato por el cual uno de los contratantes se obliga a conceder gratuitamente el uso de una cosa no fungible, y el otro contrae la obligación de restituirla individualmente."]
[]
[null,null,null,"Convenio o contrato: Se refiere al acuerdo de dos o más personas para crear, transferir, modificar o extinguir obligaciones. Los convenios que producen o transfieren las obligaciones y derechos, toman el nombre de contratos."]
[]
[null,"Derechos reales"]
[null,null,"Se refiere a aquellos derechos relacionados a la propiedad, posesión, usufructo, servidumbre, uso y habitación y los que sirven de garantía para un derecho de crédito, prenda e hipoteca, de bienes raíces susceptibles de inscripción en la institución registral. Para efectos del censo se definirán los siguientes derechos reales:"]
[]
[null,null,null,"Servidumbre: Se refiere al gravamen real impuesto sobre un inmueble en beneficio de otro perteneciente a distinto dueño."]
[]
[null,null,null,"Usufructo: Se refiere al derecho real y temporal de disfrutar de los bienes ajenos."]
[]
[null,"Digitalización"]
[null,null,"Se refiere al proceso de dar entrada electrónica a documentos fuente, tomando la imagen de un documento como un objeto para su futuro procesamiento, almacenamiento, recuperación y acceso de la información contenida en el mismo. En todos los casos la digitalización de documentos registrales debe garantizar la consistencia y el tracto registral entre los documentos en papel, su imagen digitalizada y la base de datos electrónica."]
[]
[null,"Documentos electrónicos"]
[null,null,"Se refiere a cualquier tipo de comunicación que puede ser enviada, recibida, procesada y archivada con el soporte de las tecnologías de información con los que cuente una organización. Un documento electrónico es el archivo electrónico firmado electrónicamente."]
[]
[null,"Estadísticas de operación"]
[null,null,"Se refiere a aquellas que se generan con base a las operaciones que realizan las instituciones registrales en su gestión. "]
[]
[null,"Firma electrónica"]
[null,null,"Se refiere a los datos en forma electrónica consignados en un mensaje de datos, o adjuntados o lógicamente asociados al mismo, que pueden ser utilizados para identificar al firmante en relación con el mensaje de datos e indicar que el firmante aprueba la información recogida en el mensaje.\n\nEl concepto de firma electrónica aspira a abarcar todos los usos tradicionales de una firma manuscrita con consecuencias jurídicas, siendo la identificación del firmante y la intención de firmar solo el mínimo común denominador de los diversos criterios relativos a la firma que se encuentran en los diversos ordenamientos jurídicos.\n\nEn consecuencia, definir una firma electrónica como capaz de indicar la aprobación de la información, equivale a establecer un requisito técnico previo para el reconocimiento de una determinada tecnología apta para crear el equivalente de una firma manuscrita."]
[]
[null,"Folio real electrónico"]
[null,null,"Se refiere al expediente electrónico y digital en el que se practican las inscripciones o anotaciones, mismo que se identifica de manera única a través de una clave; además contiene toda la información registral referida a un predio (superficie, linderos, colindancias titularidad y gravámenes vigentes), considerando cada uno de estos como una unidad registral con historial jurídico propio."]
[]
[null,"Folio real físico"]
[null,null,"Se refiere a un registro en papel, con el que se identifica con una clave de manera única destinado a inscribir e inmatricular cada una de las fincas, superficies, linderos y colindancias; basta su consulta para conocer la titularidad y gravámenes vigentes sobre el inmueble."]
[]
[null,"Formas precodificadas"]
[null,null,"Se refiere al documento base del sistema registral electrónico que contiene los datos esenciales sobre un acto registrable o un asiento registral, necesarios para su calificación y en su caso inscripción electrónica."]
[]
[null,"FOVISSSTE"]
[null,null,"Se refiere al Fondo de la Vivienda del Instituto de Seguridad y Servicios Sociales de los Trabajadores del Estado."]
[]
[null,"Fusión o división"]
[null,null,"Se refiere a los actos por los cuales se da la unión o separación de predios. Para efectos del censo se definirán los siguientes actos de fusión o división:"]
[]
[null,null,null,"Constitución de régimen de propiedad en condominio: Se refiere al acto por el cual se crea el régimen de propiedad de un bien inmueble construido o baldío, susceptible de aprovechamiento independientemente por tener salida propia a un elemento común de aquel o a la vía pública y que pertenece a distintos propietarios, los que tendrían derecho privativo o exclusivo de propiedad y además un derecho común de copropiedad sobre los elementos y partes comunes del inmueble, necesarios para el adecuado uso y disfrute."]
[]
[null,null,null,"División de cosa común (copropiedad): Se refiere a una de las formas por las que cesa la copropiedad."]
[]
[null,null,null,"Fraccionamiento: Se refiere a cualquier división del terreno en lotes destinados a la venta y a los siguientes usos: habitación, escuelas, recreación, comercio, industria, servicios y cualquiera otros que se les designe."]
[]
[null,null,null,"Fusión de predios: Se refiere a la unión de dos o más propiedades colindantes en un solo predio."]
[]
[null,null,null,"Lotificación: Se refiere a la división de un terreno en lotes, con fines urbanos. Es un fenómeno de ordenación urbana y debe responder por consecuencia a una justa distribución de cargas entre los interesados o dueños de lote, como son servicios comunitarios e infraestructura urbana."]
[]
[null,null,null,"Relotificación: Se refiere al acto por el cual, a dos o más lotes o áreas privativas, según corresponda, se le modifican las dimensiones o las ubicaciones originalmente establecidas en la autorización del conjunto urbano, subdivisión o condominio. También se entiende como un cambio de la distribución o dimensiones de los lotes de un predio cuyas características hayan sido autorizadas con anterioridad."]
[]
[null,null,null,"Subdivisión: Se refiere a la partición de un predio, cuya superficie no debe fraccionarse mediante vías públicas para formar unidades o manzanas."]
[]
[null,"Grandes usuarios"]
[null,null,"Se refiere a aquellos que realizan trámites registrales de forma masiva, tales como notarios, INFONAVIT, FOVISSSTE, SHF, entre otros."]
[]
[null,"Gravámenes"]
[null,null,"Se refiere a la palabra que se utiliza como sinónimo de diferentes conceptos jurídicos en relación a las cargas u obligaciones que afectan a una persona o bien. En este sentido se habla de gravámenes reales como las hipotecas, prendas y servidumbres; o de gravámenes personales que se refieren propiamente a las obligaciones. Los primeros deberán estar inscritos en la institución registral a fin de que surtan efectos contra terceros, en virtud de que se trata de una limitación a la disponibilidad del bien inscrito, o de una disminución de su valor, dependiendo del gravamen del que se trate. Su inscripción se hará constar en el folio de la finca sobre la cual recaigan. Para efectos del censo se definirán los siguientes gravámenes:"]
[]
[null,null,null,"Cédula hipotecaria: Se refiere a los títulos de valor emitidos por una persona física o moral (institución de crédito hipotecario) que otorga a su tenedor una garantía hipotecaria, constituida por el acreditado y le confiere derecho al interés fijado."]
[]
[null,null,null,"Cesión de crédito hipotecario: Se refiere al acto por el cual el crédito puede cederse, en todo o en parte, siempre que la cesión se haga en la forma que para la constitución de la hipoteca previene en la ley en la materia, se dé conocimiento al deudor y sea inscrita en la institución registral."]
[]
[null,null,null,"Constitución de reserva de dominio: Se refiere al acto por el cual se reserva la propiedad de bien determinado; constituye, por lo tanto, una limitación al dominio de este. Puede darse en los contratos de compraventa, donación, entre otros."]
[]
[null,null,null,"Crédito o hipoteca: Se refiere a la garantía real constituida sobre bienes que no se entregan al acreedor, y que da derecho a este, en caso de incumplimiento de la obligación garantizada, a ser pagado con el valor de los bienes, en el grado de preferencia establecido por la ley."]
[]
[null,null,null,"Embargo: Se refiere a la afectación decretada por una autoridad competente sobre un bien o conjunto de bienes de propiedad privada, la cual tiene por objeto asegurar cautelarmente la eventual ejecución de una pretensión de condena que se plantea o planteará en juicio (embargo preventivo, provisional o cautelar), o bien satisfacer directamente una pretensión ejecutiva (embargo definitivo, ejecutivo o apremiativo)."]
[]
[null,null,null,"Fianza: Se refiere al contrato por el cual una persona se compromete con el acreedor a pagar por el deudor, si este no lo hace."]
[]
[null,null,null,"Mutuo con garantía hipotecaria: Se refiere al contrato de mutuo que se constituye con garantía real de hipoteca. Mutuo es un contrato por el cual el mutuante se obliga a transferir la propiedad de una suma de dinero o de otras cosas fungibles al mutuario, quien se obliga a devolver otro tanto de la misma especie y calidad."]
[]
[null,null,null,"Reconocimiento de adeudo: Se refiere al contrato que se suscribe entre un acreedor y un deudor, dando certeza de la relación entre ambos. Además, se trata de una manifestación de voluntad de parte del deudor para reconocer una suma determinada en carácter de deuda. Al mismo tiempo, esto supone la existencia de un contrato anterior que ha dado origen a la deuda."]
[]
[null,"INDAABIN"]
[null,null,"Se refiere al Instituto de Administración y Avalúos de Bienes Nacionales."]
[]
[null,"Indexación"]
[null,null,"Se refiere a los índices de acceso a libros y legajos y su relación con la base de datos registral."]
[]
[null,"Indicadores de operación"]
[null,null,"Se refiere a aquellos que se generan para conocer las operaciones que realizan las instituciones registrales en su gestión."]
[]
[null,"Indicadores de servicios"]
[null,null,"Se refiere a aquellos que se generan para medir la calidad en el servicio, por lo que reflejan la eficiencia y calidad de los servicios que se prestan en la institución registral."]
[]
[null,"INEGI"]
[null,null,"Se refiere al Instituto Nacional de Estadística y Geografía."]
[]
[null,"INFONAVIT"]
[null,null,"Se refiere al Instituto del Fondo Nacional de la Vivienda para los Trabajadores."]
[]
[null,"Información existente en la institución registral"]
[null,null,"Se refiere a los asientos, inscripciones, libros, legajos, folios reales físicos o electrónicos, y en general, todos aquellos elementos que conforman el acervo documental de la institución registral."]
[]
[null,"Informante básico"]
[null,null,"Se refiere a la persona titular o servidora pública de la institución designada para atender la solicitud de información de la presente sección, y que tiene el carácter de figura responsable de entregar oficialmente la información. Cuando menos, se encuentra en el segundo o tercer nivel jerárquico."]
[]
[null,"Informante complementario 1"]
[null,null,"Se refiere a la persona servidora pública -titular o designada- adscrita al área que es la principal productora de la información correspondiente a la presente sección."]
[]
[null,"Informante complementario 2"]
[null,null,"Se refiere a la persona servidora pública -titular o designada- adscrita al área que es la segunda principal productora de la información correspondiente a la presente sección."]
[]
[null,"Inscripciones registrales"]
[null,null,"Se refiere a aquellos asientos o inscripciones en los que quedan registrados los movimientos que sufren los bienes inmuebles, bienes muebles, actos mercantiles, personas morales de carácter civil o mercantil, entre otros y que pueden o no formar parte de un folio real físico o un folio real electrónico."]
[]
[null,"INSUS"]
[null,null,"Se refiere al Instituto Nacional del Suelo Sustentable."]
[]
[null,"Legajos"]
[null,null,"Se refiere al conjunto de documentos que son relativos una inscripción o registro determinado que archivan ordenadamente en el acervo registral y que han de surtir efectos en la institución registral, sin que estos consten incorporados a la inscripción registral. "]
[]
[null,"Libros"]
[null,null,"Se refiere al compendio de asientos registrales."]
[]
[null,"Manual de organización"]
[null,null,"Se refiere a aquellos instrumentos de apoyo administrativo que describen en forma ordenada y sistemática las relaciones orgánicas que se dan entre los elementos de la estructura organizacional de una determinada unidad administrativa."]
[]
[null,"Manual de procedimientos"]
[null,null,"Se refiere al documento de carácter técnico donde se identifican los procesos de trabajo, tanto sustantivos como administrativos, con el objetivo de coordinar y sistematizar las funciones en un marco de transparencia y eficiencia."]
[]
[null,"Manzana"]
[null,null,"Se refiere a la extensión territorial que está constituida por un grupo de viviendas, edificios, predios, lotes o terrenos de uso habitacional, comercial, industrial o de servicios; generalmente se puede rodear en su totalidad y está delimitada por calles, andadores, brechas, veredas, cercas, arroyos, barrancos o límites prediales."]
[]
[null,"Modificación de medidas y linderos"]
[null,null,"Se refiere a modificación de los límites previamente determinados de un predio, en relación con sus colindantes."]
[]
[null,"Norma Técnica para la Generación, Captación e Integración de Datos Catastrales y Registrales con fines estadísticos y geográficos"]
[null,null,"Se refiere al documento que contiene las disposiciones que establecen las especificaciones técnicas para la generación, captación e integración de datos catastrales y registrales."]
[]
[null,"Otras instituciones"]
[null,null,"Se refiere a aquellas que tienen relación con la actividad registral, tales como catastro, RAN, INDAABIN, entre otros."]
[]
[null,"Patrimonio de familia"]
[null,null,"Se refiere a aquel que puede constituirse sobre la casa habitación de la familia y en algunos casos, sobre una parcela cultivable. Solo puede constituirse el patrimonio de la familia con bienes sitos en el lugar en que esté domiciliado el que lo constituya. Tienen derecho de habitar la casa y de aprovechar los frutos de la parcela afecta al patrimonio de la familia el cónyuge del que lo constituye y las personas a quienes tiene obligación de dar alimentos. Los bienes afectos al patrimonio de la familia son inalienables y no estarán sujetos a embargo ni a gravamen alguno."]
[]
[null,"Portal"]
[null,null,"Se refiere a la interfaz y/ o punto de contacto del usuario con los sistemas informáticos de una institución, utilizando como medio la red global de comunicación pública denominada Internet y/ o utilizando la red de comunicaciones privada denominada Intranet de la institución."]
[]
[null,"Principios registrales"]
[null,null,"Se refiere a las orientaciones capitales, líneas directrices, serie sistemática de bases fundamentales del ordenamiento jurídico registral. Para efectos del censo se definirán los siguientes principios registrales:"]
[]
[null,null,null,"Apariencia jurídica: Se refiere al principio mediante el cual, los actos realizados por una persona engañada por una situación jurídica que es contraria a la realidad, pero que presenta exteriormente las características de una situación jurídica verdadera, son definitivos y oponibles como lo serían los actos fundados en situaciones absolutamente regulares. "]
[]
[null,null,null,"Consentimiento: Se refiere a la necesidad del consentimiento de quien aparece inscrito, para que se cancele su inscripción y se haga una diferente a favor de otra persona, y cuya conformidad debe, además, constar en escritura pública.\n\nPara que el registro se realice, debe basarse la inscripción en el consentimiento de la parte perjudicada en su derecho; es decir, debe basarse en un acuerdo de voluntades entre el transferente (perjudicado) y el adquirente (beneficiado); y como solo puede consentir el que puede disponer, solo puede consentir el verdadero titular. En sentido negativo, nadie puede ser dado de baja en el registro sin su consentimiento."]
[]
[null,null,null,"Desarrollo multifinalitario: Se refiere al principio que se desarrolla con la participación de especialistas en las distintas disciplinas de las ciencias de la tierra y afines, utilizando las tecnologías de la información y comunicaciones."]
[]
[null,null,null,"Equivalencia funcional: Se refiere al principio que señala que no se negarán efectos jurídicos, validez o fuerza obligatoria a la información por la sola razón de que esté en forma de mensaje de datos. No se discriminará entre el documento escrito y el electrónico, y en caso de que la legislación aplicable requiera que la información conste por escrito, el requisito quedará satisfecho con el mensaje de datos si la información que contiene es accesible y segura para posterior consulta. Tanto la información escrita como en formato electrónico tendrán la fuerza probatoria que señalen las leyes."]
[]
[null,null,null,"Especialidad o determinación: Se refiere no solo en la necesidad de determinar y concretar en la inscripción los créditos garantizados y las fincas gravadas cuando se trata de una hipoteca, sino también en la necesidad de que en toda inscripción de propiedad u otros derechos reales sobre inmuebles se especifiquen pormenorizadamente las características del inmueble objeto del derecho real: su valor, la naturaleza del derecho, el acto jurídico que le dio origen, los nombres y generales de las personas que intervinieron en el acto, así como la fecha del título y el funcionario que lo autorizó.\n\nA este principio se le ha llamado también principio de Determinación, porque la publicidad registral exige determinar con precisión el bien objeto de los derechos, probablemente el término Especialidad nació como oposición o reacción contra la “generalidad” de las hipotecas."]
[]
[null,null,null,"Fe pública registral: Se refiere al principio que consiste en la necesidad de tener como verdad única y total a propósito de un determinado derecho real inmobiliario, exclusivamente los datos que aparecen inscritos en la institución registral, tanto para saber si el titular inscrito de ese derecho real puede disponer de él válidamente, como para saber si es válida la adquisición del mismo derecho por un tercero de buena fe que se atuvo a esos datos registrales y confió en ellos para adquirirlo."]
[]
[null,null,null,"Identidad: Se refiere al medio por el cual, los entes generadores de la cartografía identifican al objeto territorial en el espacio geográfico, independientemente del dominio o posesión."]
[]
[null,null,null,"Inscripción: Se refiere a todo asiento hecho en la institución registral; también significa el acto mismo de inscribir. Los derechos nacidos extrarregistralmente, al inscribirse, adquieren mayor firmeza y protección, por la fuerza probatoria que el registro les da.\n\nEste principio tiende a precisar la influencia que el registro ejerce en los derechos sobre inmuebles y también decide si la inscripción en la institución registral es elemento determinante o no para que el negocio dispositivo provoque el efecto jurídico. En México, el acto nace fuera de la institución registral, ante Notario, por lo que no existen inscripciones constitutivas, ni menos sustantivas, simplemente declarativas."]
[]
[null,null,null,"Legalidad y calificación registral: Se refiere al principio que impide el ingreso la institución registral de títulos inválidos o imperfectos, por lo tanto, todo lo registrado se presume que lo ha sido legalmente; y el medio de lograrlo es someter los títulos a examen, que es lo que se llama calificación registral.\n\nEn suma, este principio consiste en la función atribuida al personal la institución registral para examinar cada uno de los documentos que se presentan para su inscripción y determinar no solo si es de los documentos susceptibles de inscribirse, sino también si el acto que contiene satisface los requisitos de forma exigidos por cualquier ley, a fin de proceder en caso afirmativo a llevar a cabo la inscripción solicitada, previo el pago de los derechos correspondientes del registro o, en caso contrario, a suspenderla si el documento tiene defectos subsanables o denegarla si los defectos son insubsanables."]
[]
[null,null,null,"Legitimación: Se refiere al principio por el cual, el titular (verdadero) de un derecho subjetivo está legitimado (con poder jurídico legal) para exigir que exista a su favor una exteriorización (apariencia) de su derecho, es decir, para hacer concordar su titularidad (derecho subjetivo) con la situación posesoria o registral. Ejemplo: El dueño puede poseer, gozar, administrar su propiedad y registrar su título. Si a pesar de los medios o poderes que la ley le concede, el legitimado no actúa y no logra esa concordancia, surge la necesidad de proteger la apariencia jurídica, pues cuando hay discordancia entre el titular verdadero y el titular aparente, se produce una apariencia de titularidad. La legitimación tiende a proteger al verdadero titular del derecho subjetivo (ordinaria) y solo por necesidad y forzada, la norma protege a veces (extraordinaria) al titular aparente."]
[]
[null,null,null,"Oponibilidad: Se refiere a la facultad del legítimo titular del derecho real consignado en la inscripción de exhibir su derecho como prevalente y prioritario frente a terceros contra prueba en contrario."]
[]
[null,null,null,"Prioridad o prelación: Se refiere a que la preferencia entre derechos reales sobre una misma finca se determina por el orden de la registración y no por la antigüedad del otorgamiento del título. La fecha de presentación va a determinar la preferencia y rango del documento que ha ingresado a registro. Este principio únicamente se concibe por la posibilidad que se da de que existan dos o más títulos contradictorios. "]
[]
[null,null,null,"Propiedad: Se refiere al principio conforme al cual, ante la existencia de dos títulos contradictorios, prevalece el primero que se haya inscrito."]
[]
[null,null,null,"Publicidad: Se refiere al principio en el que, al realizarse el registro se revela la situación jurídica de los inmuebles y toda persona, sea o no tercero registral o interesado, tiene derecho de que se le muestren los asientos del registro y de obtener constancias relativas a los mismos. La publicidad se da a través de la inscripción en la institución registral, pues la celebración de un contrato no es suficiente para ser oponible a terceros."]
[]
[null,null,null,"Rogación: Se refiere a la petición de parte interesada, mandato judicial o administrativo dirigido al registrador a fin de que proceda a la inscripción de un acto. El registrador no puede registrar de oficio, aunque conozca el acto que vaya a dar origen a un cambio en los asientos de la institución registral. Se requiere que alguien se lo pida; que alguien haga una solicitud. Esta necesidad de instancia es lo que se conoce con el nombre de principio de rogación. La inscripción en la institución registral se realiza a instancia de parte y nunca de oficio. Este principio está estrechamente ligado con el de consentimiento, pues en la mayoría de los casos, la petición de inscripción debe ser hecha por el titular registral."]
[]
[null,null,null,"Socialización: Se refiere al principio que consiste en el aprovechamiento de la información de la institución registral para el desarrollo social y el fortalecimiento institucional de la estructura de gobierno."]
[]
[null,null,null,"Tercero registral: Se refiere al principio conforme al cual, para efectos del registro, se entiende por tercero, a quien sin ser parte en el acto jurídico que originó la inscripción, tiene un derecho sobre el bien inscrito."]
[]
[null,null,null,"Tracto sucesivo: Se refiere al principio también llamado de tracto continuo. Es un principio de sucesión, de ordenación. Es un derivado del principio del consentimiento, por el que el titular de una inscripción queda inmunizado o protegido contra todo cambio no consentido por él.\n \nEs también consecuencia del sistema de folio real que exige un registro concatenado, en el que el transferente de hoy, es el adquirente de ayer; y el titular inscrito es el transferente de mañana; y solo tiene como excepción que la inscripción que vaya a hacerse sea una “inmatriculación” de un bien inmueble que por no estar inscrito antes en la institución registral, no tenga antecedente registral que deba cancelarse. Del principio de tracto, resulta la posibilidad de llevar al registro lo que provenga del titular inscrito, así como la prohibición de registrar lo que no emana de él."]
[]
[null,null,null,"Ubicación geográfica: Se refiere al principio por el cual, se considera a toda información gráfica que está georreferenciada de acuerdo al marco geodésico vigente."]
[]
[null,null,null,"Veracidad: Se refiere al principio que presume que la información gráfica y alfanumérica que expiden los entes generadores de catastro, representan la realidad física del predio."]
[]
[null,"Programa de modernización de los registros públicos de la propiedad y catastros"]
[null,null,"Se refiere al programa que contribuye al ordenamiento y la planeación territorial como articuladores del bienestar de las personas y el uso eficiente del suelo, a través de instituciones registrales y/ o catastrales con apego al Modelo Integral del Registro Público de la Propiedad y Modelo Óptimo de Catastro."]
[]
[null,"RAN"]
[null,null,"Se refiere al Registro Agrario Nacional."]
[]
[null,"Rectificación "]
[null,null,"Se refiere a la rectificación de los asientos por causa de error material o de concepto. Solo procederá cuando exista discrepancia entre el título y la inscripción."]
[]
[null,"Registral"]
[null,null,"Se refiere a las funciones propias de la institución registral como ente encargado principalmente de dar publicidad a los actos jurídicos sujetos de registro o inscripción. "]
[]
[null,"Registro Público de la Propiedad o institución registral"]
[null,null,"Se refiere a la institución mediante la cual el Estado proporciona el servicio de dar publicidad, seguridad y certeza a los actos jurídicos que, conforme a la ley precisan de ese requisito para surtir efectos contra terceros, independientemente de que se encuentren a cargo de la autoridad federal, estatal o municipal."]
[]
[null,"Reposición "]
[null,null,"Se refiere a aquella que se realiza sobre los folios y asientos registrales cuando, por su destrucción, mutilación o extravío no sea posible realizar su consulta a fin de establecer el tracto sucesivo correspondiente."]
[]
[null,"Riesgo"]
[null,null,"Se refiere a los daños o perdidas probables sobre un agente afectable, resultado de la interacción entre su vulnerabilidad y la presencia de un agente perturbador."]
[]
[null,"SAT"]
[null,null,"Se refiere al Servicio de Administración Tributaria. "]
[]
[null,"SEDATU"]
[null,null,"Se refiere a la Secretaría de Desarrollo Agrario, Territorial y Urbano."]
[]
[null,"SHF"]
[null,null,"Se refiere a la Sociedad Hipotecaria Federal."]
[]
[null,"Sistema de gestión registral"]
[null,null,"Se refiere al programa informático a través del cual se realiza la captura almacenamiento, custodia, seguridad, consulta, reproducción, verificación, administración y transmisión de la información en la institución registral."]
[]
[null,"Tecnologías de la información"]
[null,null,"Se refiere a las instalaciones, equipos de computación y de comunicaciones, sistemas de aplicación y bases de datos que tienen que ser administrados para proporcionar soporte a los procesos de una organización; satisfaciendo sus requerimientos de información con efectividad, eficiencia, confidencialidad, integridad, disponibilidad, cumplimiento y confiabilidad."]
[]
[null,"Traslativo de dominio"]
[null,null,"Se refiere al efecto de los actos o contratos que tienen como finalidad la transmisión del dominio del bien y la transmisión de la titularidad de los derechos que sobre el mismo se tienen. Para efectos del censo se definirán los actos traslativos de dominio:"]
[]
[null,null,null,"Adjudicación: Se refiere al acto por medio del cual se declara que la propiedad de un bien o conjunto de bienes pasa al patrimonio de una persona."]
[]
[null,null,null,"Aplicación de bienes por disolución de la sociedad conyugal: Se refiere al acto por el cual la sociedad conyugal puede terminar antes de que se disuelva el matrimonio, si así lo convienen los esposos. La sociedad conyugal termina por la disolución del matrimonio, por voluntad de los consortes, por la sentencia que declare la presunción de muerte del cónyuge ausente y en los casos previstos en la ley en la materia. Disuelta la sociedad se procederá a formar inventario, en el cual no se incluirán el lecho, los vestidos ordinarios y los objetos de uso personal de los consortes, que serán de estos o de sus herederos."]
[]
[null,null,null,"Aportación de bienes a una sociedad: Se refiere la transmisión de bienes del dominio de los socios a la sociedad."]
[]
[null,null,null,"Cesión de bien inmueble: Se refiere a la cesión voluntaria que el deudor haga de sus bienes a favor de sus acreedores."]
[]
[null,null,null,"Compraventa: Se refiere al contrato en el que uno de los contratantes se obliga a transferir la propiedad de una cosa o de un derecho, y el otro a su vez se obliga a pagar por ellos un precio cierto y en dinero."]
[]
[null,null,null,"Dación en pago: Se refiere al acto por el cual el acreedor recibe en pago una cosa distinta en lugar de la debida."]
[]
[null,null,null,"Donación: Se refiere al contrato por el que una persona transfiere a otra, gratuitamente, una parte o la totalidad de sus bienes presentes."]
[]
[null,null,null,"Fideicomiso: Se refiere al contrato en virtud del cual, el fideicomitente transmite a una institución fiduciaria la propiedad o la titularidad de uno o más bienes o derechos, según sea el caso, para ser destinados a fines lícitos y determinados, encomendando la realización de dichos fines a la propia institución fiduciaria. "]
[]
[null,null,null,"Permuta: Se refiere al contrato por el cual cada uno de los contratantes se obliga a dar una cosa por otra."]
[]
[null,null,null,"Prescripción positiva: Se refiere al medio para adquirir bienes mediante el transcurso de cierto tiempo y bajo las condiciones establecidas por la ley. La prescripción positiva también llamada prescripción adquisitiva o usucapión, se refiere a la adquisición de bienes en virtud de la posesión.\n\nEl que hubiere poseído bienes inmuebles por el tiempo y con las condiciones exigidas por la ley en la materia, para adquirirlos por prescripción, puede promover juicio contra el que aparezca como propietario de esos bienes en la institución registral, a fin de que se declare que la prescripción se ha consumado y que ha adquirido, por ende, la propiedad."]
[]
[null,null,null,"Título de propiedad: Se refiere a la causa, razón o motivo que da derecho a algo y también al documento en el que consta ese derecho. En sentido jurídico es una relación existente entre una o más personas respecto de un bien, así como el instrumento que prueba esa relación. La Ley Agraria dispone que el RAN emita el título de propiedad respectivo cuando el ejidatario asuma el dominio pleno sobre sus parcelas, documento que será inscrito en el Registro Público de la Propiedad correspondiente. Asimismo, la Ley Agraria establece que cuando la asamblea efectúe la asignación de solares a ejidatarios y avecindados, el acta respectiva se inscribirá en el RAN y los certificados que expida de cada solar constituirán los títulos de propiedad a favor de su titular, documentos que deben ser inscritos en el Registro Público de la Propiedad de la localidad. "]
[]
[null,"UIF"]
[null,null,"Se refiere a la Unidad de Inteligencia Financiera."]
[]
[null,"Validez jurídica "]
[null,null,"Se refiere a una disposición o conjunto de disposiciones que son reconocidas como normas jurídicas por las leyes."]

{"sheet":"listas","index":14,"n_rows":2511,"n_cols":13,"rows_kept":2511,"cut":false,"hidden":true,"merged":[]}
["L_ENTIDAD","CVE","MUN",null,"L_SNS","L_X","L_Antiguedad","L_Escolaridad",null,"NOM_ENT","CVE_ENT","NOM_MUN","CVE_MUN"]
["Aguascalientes ","01",11,null,1,"X",1,1,null,"Aguascalientes","01","Aguascalientes","001"]
["Baja California","02",7,null,2,null,2,2,null,"Aguascalientes","01","Asientos","002"]
["Baja California Sur","03",5,null,9,null,3,3,null,"Aguascalientes","01","Calvillo","003"]
["Campeche","04",13,null,null,null,4,4,null,"Aguascalientes","01","Cosío","004"]
["Coahuila de Zaragoza","05",38,null,null,null,5,5,null,"Aguascalientes","01","Jesús María","005"]
["Colima","06",10,null,null,null,6,6,null,"Aguascalientes","01","Pabellón de Arteaga","006"]
["Chiapas","07",124,null,null,null,7,7,null,"Aguascalientes","01","Rincón de Romos","007"]
["Chihuahua","08",67,null,null,null,8,8,null,"Aguascalientes","01","San José de Gracia","008"]
["Ciudad de México","09",16,null,null,null,9,9,null,"Aguascalientes","01","Tepezalá","009"]
["Durango","10",39,null,null,null,10,null,null,"Aguascalientes","01","El Llano","010"]
["Guanajuato","11",46,null,null,null,11,null,null,"Aguascalientes","01","San Francisco de los Romo","011"]
["Guerrero","12",85,null,null,null,12,null,null,"Aguascalientes","01","Sin municipio identificado","999"]
["Hidalgo","13",84,null,null,null,99,null,null,"Baja California","02","Ensenada","001"]
["Jalisco","14",125,null,null,null,null,null,null,"Baja California","02","Mexicali","002"]
["México","15",125,null,null,null,null,null,null,"Baja California","02","Tecate","003"]
["Michoacán de Ocampo","16",113,null,"L_SINO","L_CARACT","L_Actividad","L_EMPANT",null,"Baja California","02","Tijuana","004"]
["Morelos","17",36,null,"Sí",1,1,1,null,"Baja California","02","Playas de Rosarito","005"]
["Nayarit","18",20,null,"No",2,2,2,null,"Baja California","02","San Quintín","006"]
["Nuevo León","19",51,null,null,null,3,3,null,"Baja California","02","San Felipe","007"]
["Oaxaca","20",570,null,null,null,4,4,null,"Baja California","02","Sin municipio identificado","999"]
["Puebla","21",217,null,null,null,5,5,null,"Baja California Sur","03","Comondú","001"]
["Querétaro","22",18,null,null,null,6,6,null,"Baja California Sur","03","Mulegé","002"]
["Quintana Roo","23",11,null,null,null,7,7,null,"Baja California Sur","03","La Paz","003"]
["San Luis Potosí","24",59,null,null,null,8,8,null,"Baja California Sur","03","Los Cabos","008"]
["Sinaloa","25",20,null,null,null,9,9,null,"Baja California Sur","03","Loreto","009"]
["Sonora","26",72,null,null,null,10,10,null,"Baja California Sur","03","Sin municipio identificado","999"]
["Tabasco","27",17,null,null,null,11,11,null,"Campeche","04","Calkiní","001"]
["Tamaulipas","28",43,null,null,null,12,12,null,"Campeche","04","Campeche","002"]
["Tlaxcala","29",60,null,null,null,13,99,null,"Campeche","04","Carmen","003"]
["Veracruz de Ignacio de la Llave","30",212,null,null,null,14,null,null,"Campeche","04","Champotón","004"]
["Yucatán","31",106,null,null,null,99,null,null,"Campeche","04","Hecelchakán","005"]
["Zacatecas","32",58,null,null,null,null,null,null,"Campeche","04","Hopelchén","006"]
[null,null,null,null,null,null,null,null,null,"Campeche","04","Palizada","007"]
[null,null,null,null,null,null,null,null,null,"Campeche","04","Tenabo","008"]
[null,null,null,null,null,null,null,null,null,"Campeche","04","Escárcega","009"]
[null,null,null,null,null,null,null,null,null,"Campeche","04","Calakmul","010"]
[null,null,null,null,null,null,null,null,null,"Campeche","04","Candelaria","011"]
[null,"P2",null,"P3",null,null,null,null,null,"Campeche","04","Seybaplaya","012"]
[null,"COORDINACIÓN DE REGISTRO PÚBLICO",null,"CONSEJERÍA JURÍDICA",null,null,null,null,null,"Campeche","04","Dzitbalché","013"]
[null,"DEPARTAMENTO DE REGISTRO PÚBLICO",null,"CONSEJERÍA JURÍDICA Y DE SERVICIOS LEGALES DE LA CIUDAD DE MÉXICO",null,null,null,null,null,"Campeche","04","Sin municipio identificado","999"]
[null,"DEPARTAMENTO REGISTRAL",null,"DIRECCIÓN DE CATASTRO Y REGISTRO PÚBLICO",null,null,null,null,null,"Coahuila de Zaragoza","05","Abasolo","001"]
[null,"DIRECCIÓN DE NOTARÍAS Y REGISTROS PÚBLICOS DEL ESTADO DE TLAXCALA",null,"DIRECCIÓN GENERAL DE CATASTRO Y REGISTRO PÚBLICO",null,null,null,null,null,"Coahuila de Zaragoza","05","Acuña","002"]
[null,"DIRECCIÓN DE REGISTRO PÚBLICO DE LA PROPIEDAD",null,"DIRECCIÓN GENERAL DE REGISTROS PÚBLICOS DE LA PROPIEDAD Y NOTARÍAS",null,null,null,null,null,"Coahuila de Zaragoza","05","Allende","003"]
[null,"DIRECCION DE REGISTRO PUBLICO DE LA PROPIEDAD INMUEBLE Y DE COMERCIO",null,"DIRECCIÓN GENERAL DEL REGISTRO PÚBLICO DE LA PROPIEDAD Y DE INSPECCIÓN Y ARCHIVO GENERAL DE NOTARIAS",null,null,null,null,null,"Coahuila de Zaragoza","05","Arteaga","004"]
[null,"DIRECCIÓN DEL REGISTRO PÚBLICO",null,"DIRECCIÓN GENERAL DEL REGISTRO PÚBLICO DE LA PROPIEDAD Y DEL NOTARIADO",null,null,null,null,null,"Coahuila de Zaragoza","05","Candela","005"]
[null,"DIRECCIÓN DEL REGISTRO PÚBLICO DE LA PROPIEDAD DEL ESTADO DE QUERÉTARO",null,"GOBIERNO DEL ESTADO DE BAJA CALIFORNIA",null,null,null,null,null,"Coahuila de Zaragoza","05","Castaños","006"]
[null,"DIRECCIÓN DEL REGISTRO PÚBLICO DE LA PROPIEDAD Y DE COMERCIO PARA EL ESTADO DE BAJA CALIFORNIA",null,"INSTITUTO CATASTRAL Y REGISTRAL DEL ESTADO DE SONORA",null,null,null,null,null,"Coahuila de Zaragoza","05","Cuatro Ciénegas","007"]
[null,"DIRECCIÓN DEL REGISTRO PÚBLICO DE LA PROPIEDAD Y DEL COMERCIO",null,"INSTITUTO DE SEGURIDAD JURÍDICA PATRIMONIAL DE YUCATÁN",null,null,null,null,null,"Coahuila de Zaragoza","05","Escobedo","008"]
[null,"DIRECCION GENERAL DE SERVICIOS REGISTRALES ",null,"INSTITUTO PARA EL REGISTRO DEL TERRITORIO DEL ESTADO DE COLIMA",null,null,null,null,null,"Coahuila de Zaragoza","05","Francisco I. Madero","009"]
[null,"DIRECCIÓN GENERAL DEL REGISTRO PÚBLICO DE LA PROPIEDAD Y DE COMERCIO DEL ESTADO DE CAMPECHE",null,"INSTITUTO REGISTRAL Y CATASTRAL",null,null,null,null,null,"Coahuila de Zaragoza","05","Frontera","010"]
[null,"DIRECCIÓN GENERAL DEL REGISTRO PÚBLICO DE LA PROPIEDAD Y DEL COMERCIO",null,"INSTITUTO REGISTRAL Y CATASTRAL DEL ESTADO DE COAHUILA DE ZARAGOZA",null,null,null,null,null,"Coahuila de Zaragoza","05","General Cepeda","011"]
[null,"INSTITUTO DE LA FUNCIÓN REGISTRAL",null,"INSTITUTO REGISTRAL Y CATASTRAL DEL ESTADO DE MICHOACÁN DE OCAMPO",null,null,null,null,null,"Coahuila de Zaragoza","05","Guerrero","012"]
[null,"INSTITUTO DE LA FUNCIÓN REGISTRAL DEL ESTADO DE MÉXICO",null,"INSTITUTO REGISTRAL Y CATASTRAL DEL ESTADO DE NUEVO LEÓN",null,null,null,null,null,"Coahuila de Zaragoza","05","Hidalgo","013"]
[null,"INSTITUTO DE LA FUNCIÓN REGISTRAL DEL ESTADO DE OAXACA",null,"INSTITUTO REGISTRAL Y CATASTRAL DEL ESTADO DE PUEBLA",null,null,null,null,null,"Coahuila de Zaragoza","05","Jiménez","014"]
[null,"INSTITUTO DE SERVICIOS REGISTRALES Y CATASTRALES DEL ESTADO DE MORELOS",null,"INSTITUTO REGISTRAL Y CATASTRAL DEL ESTADO DE QUERÉTARO",null,null,null,null,null,"Coahuila de Zaragoza","05","Juárez","015"]
[null,"REGISTRO PÚBLICO DE LA PROPIEDAD DEL ESTADO DE GUANAJUATO",null,"INSTITUTO REGISTRAL Y CATASTRAL DEL ESTADO DE SAN LUÍS POTOSÍ",null,null,null,null,null,"Coahuila de Zaragoza","05","Lamadrid","016"]
[null,"REGISTRO PÚBLICO DE LA PROPIEDAD Y DEL COMERCIO DEL ESTADO DE QUINTANA ROO",null,"INSTITUTO REGISTRAL Y CATASTRAL DEL ESTADO DE TAMAULIPAS",null,null,null,null,null,"Coahuila de Zaragoza","05","Matamoros","017"]
[null,"SUBDIRECCIÓN DE REGISTRO PÚBLICO DE LA PROPIEDAD",null,"SECRETARÍA DE FINANZAS Y ADMINISTRACIÓN",null,null,null,null,null,"Coahuila de Zaragoza","05","Monclova","018"]
[null,"OTRO",null,"SECRETARÍA DE GOBIERNO",null,null,null,null,null,"Coahuila de Zaragoza","05","Morelos","019"]
[null,null,null,"SECRETARIA GENERAL DE GOBIERNO",null,null,null,null,null,"Coahuila de Zaragoza","05","Múzquiz","020"]
[null,null,null,"SECRETARÍA GENERAL DE GOBIERNO DEL ESTADO DE GUERRERO",null,null,null,null,null,"Coahuila de Zaragoza","05","Nadadores","021"]
[null,null,null,"SUBSECRETARIA DE SERVICIOS Y GOBERNANZA POLÍTICA",null,null,null,null,null,"Coahuila de Zaragoza","05","Nava","022"]
[null,null,null,"OTRO",null,null,null,null,null,"Coahuila de Zaragoza","05","Ocampo","023"]
[null,null,null,null,null,null,null,null,null,"Coahuila de Zaragoza","05","Parras","024"]
[null,null,null,null,null,null,null,null,null,"Coahuila de Zaragoza","05","Piedras Negras","025"]
[null,null,null,null,null,null,null,null,null,"Coahuila de Zaragoza","05","Progreso","026"]
[null,null,null,null,null,null,null,null,null,"Coahuila de Zaragoza","05","Ramos Arizpe","027"]
[null,null,null,null,null,null,null,null,null,"Coahuila de Zaragoza","05","Sabinas","028"]
[null,null,null,null,null,null,null,null,null,"Coahuila de Zaragoza","05","Sacramento","029"]
[null,null,null,null,null,null,null,null,null,"Coahuila de Zaragoza","05","Saltillo","030"]
[null,null,null,null,null,null,null,null,null,"Coahuila de Zaragoza","05","San Buenaventura","031"]
[null,null,null,null,null,null,null,null,null,"Coahuila de Zaragoza","05","San Juan de Sabinas","032"]
[null,null,null,null,null,null,null,null,null,"Coahuila de Zaragoza","05","San Pedro","033"]
[null,null,null,null,null,null,null,null,null,"Coahuila de Zaragoza","05","Sierra Mojada","034"]
[null,null,null,null,null,null,null,null,null,"Coahuila de Zaragoza","05","Torreón","035"]
[null,null,null,null,null,null,null,null,null,"Coahuila de Zaragoza","05","Viesca","036"]
[null,null,null,null,null,null,null,null,null,"Coahuila de Zaragoza","05","Villa Unión","037"]
[null,null,null,null,null,null,null,null,null,"Coahuila de Zaragoza","05","Zaragoza","038"]
[null,null,null,null,null,null,null,null,null,"Coahuila de Zaragoza","05","Sin municipio identificado","999"]
[null,null,null,null,null,null,null,null,null,"Colima","06","Armería","001"]
[null,null,null,null,null,null,null,null,null,"Colima","06","Colima","002"]
[null,null,null,null,null,null,null,null,null,"Colima","06","Comala","003"]
[null,null,null,null,null,null,null,null,null,"Colima","06","Coquimatlán","004"]
[null,null,null,null,null,null,null,null,null,"Colima","06","Cuauhtémoc","005"]
[null,null,null,null,null,null,null,null,null,"Colima","06","Ixtlahuacán","006"]
[null,null,null,null,null,null,null,null,null,"Colima","06","Manzanillo","007"]
[null,null,null,null,null,null,null,null,null,"Colima","06","Minatitlán","008"]
[null,null,null,null,null,null,null,null,null,"Colima","06","Tecomán","009"]
[null,null,null,null,null,null,null,null,null,"Colima","06","Villa de Álvarez","010"]
[null,null,null,null,null,null,null,null,null,"Colima","06","Sin municipio identificado","999"]
[null,null,null,null,null,null,null,null,null,"Chiapas","07","Acacoyagua","001"]
[null,null,null,null,null,null,null,null,null,"Chiapas","07","Acala","002"]
[null,null,null,null,null,null,null,null,null,"Chiapas","07","Acapetahua","003"]
[null,null,null,null,null,null,null,null,null,"Chiapas","07","Altamirano","004"]
[null,null,null,null,null,null,null,null,null,"Chiapas","07","Amatán","005"]
[null,null,null,null,null,null,null,null,null,"Chiapas","07","Amatenango de la Frontera","006"]
[null,null,null,null,null,null,null,null,null,"Chiapas","07","Amatenango del Valle","007"]
[null,null,null,null,null,null,null,null,null,"Chiapas","07","Ángel Albino Corzo","008"]
[null,null,null,null,null,null,null,null,null,"Chiapas","07","Arriaga","009"]
[null,null,null,null,null,null,null,null,null,"Chiapas","07","Bejucal de Ocampo","010"]
[null,null,null,null,null,null,null,null,null,"Chiapas","07","Bella Vista","011"]
[null,null,null,null,null,null,null,null,null,"Chiapas","07","Berriozábal","012"]
[null,null,null,null,null,null,null,null,null,"Chiapas","07","Bochil","013"]
[null,null,null,null,null,null,null,null,null,"Chiapas","07","El Bosque","014"]
[null,null,null,null,null,null,null,null,null,"Chiapas","07","Cacahoatán","015"]
[null,null,null,null,null,null,null,null,null,"Chiapas","07","Catazajá","016"]
[null,null,null,null,null,null,null,null,null,"Chiapas","07","Cintalapa de Figueroa","017"]
[null,null,null,null,null,null,null,null,null,"Chiapas","07","Coapilla","018"]
[null,null,null,null,null,null,null,null,null,"Chiapas","07","Comitán de Domínguez","019"]
[null,null,null,null,null,null,null,null,null,"Chiapas","07","La Concordia","020"]
[null,null,null,null,null,null,null,null,null,"Chiapas","07","Copainalá","021"]
[null,null,null,null,null,null,null,null,null,"Chiapas","07","Chalchihuitán","022"]
[null,null,null,null,null,null,null,null,null,"Chiapas","07","Chamula","023"]
[null,null,null,null,null,null,null,null,null,"Chiapas","07","Chanal","024"]
[null,null,null,null,null,null,null,null,null,"Chiapas","07","Chapultenango","025"]
[null,null,null,null,null,null,null,null,null,"Chiapas","07","Chenalhó","026"]
[null,null,null,null,null,null,null,null,null,"Chiapas","07","Chiapa de Corzo","027"]
[null,null,null,null,null,null,null,null,null,"Chiapas","07","Chiapilla","028"]
[null,null,null,null,null,null,null,null,null,"Chiapas","07","Chicoasén","029"]
[null,null,null,null,null,null,null,null,null,"Chiapas","07","Chicomuselo","030"]
[null,null,null,null,null,null,null,null,null,"Chiapas","07","Chilón","031"]
[null,null,null,null,null,null,null,null,null,"Chiapas","07","Escuintla","032"]
[null,null,null,null,null,null,null,null,null,"Chiapas","07","Francisco León","033"]
[null,null,null,null,null,null,null,null,null,"Chiapas","07","Frontera Comalapa","034"]
[null,null,null,null,null,null,null,null,null,"Chiapas","07","Frontera Hidalgo","035"]
[null,null,null,null,null,null,null,null,null,"Chiapas","07","La Grandeza","036"]
[null,null,null,null,null,null,null,null,null,"Chiapas","07","Huehuetán","037"]
[null,null,null,null,null,null,null,null,null,"Chiapas","07","Huixtán","038"]
[null,null,null,null,null,null,null,null,null,"Chiapas","07","Huitiupán","039"]
[null,null,null,null,null,null,null,null,null,"Chiapas","07","Huixtla","040"]
[null,null,null,null,null,null,null,null,null,"Chiapas","07","La Independencia","041"]
[null,null,null,null,null,null,null,null,null,"Chiapas","07","Ixhuatán","042"]
[null,null,null,null,null,null,null,null,null,"Chiapas","07","Ixtacomitán","043"]
[null,null,null,null,null,null,null,null,null,"Chiapas","07","Ixtapa","044"]
[null,null,null,null,null,null,null,null,null,"Chiapas","07","Ixtapangajoya","045"]
[null,null,null,null,null,null,null,null,null,"Chiapas","07","Jiquipilas","046"]
[null,null,null,null,null,null,null,null,null,"Chiapas","07","Jitotol","047"]
[null,null,null,null,null,null,null,null,null,"Chiapas","07","Juárez","048"]
[null,null,null,null,null,null,null,null,null,"Chiapas","07","Larráinzar","049"]
[null,null,null,null,null,null,null,null,null,"Chiapas","07","La Libertad","050"]
[null,null,null,null,null,null,null,null,null,"Chiapas","07","Mapastepec","051"]
[null,null,null,null,null,null,null,null,null,"Chiapas","07","Las Margaritas","052"]
[null,null,null,null,null,null,null,null,null,"Chiapas","07","Mazapa de Madero","053"]
[null,null,null,null,null,null,null,null,null,"Chiapas","07","Mazatán","054"]
[null,null,null,null,null,null,null,null,null,"Chiapas","07","Metapa","055"]
[null,null,null,null,null,null,null,null,null,"Chiapas","07","Mitontic","056"]
[null,null,null,null,null,null,null,null,null,"Chiapas","07","Motozintla","057"]
[null,null,null,null,null,null,null,null,null,"Chiapas","07","Nicolás Ruíz","058"]
[null,null,null,null,null,null,null,null,null,"Chiapas","07","Ocosingo","059"]
[null,null,null,null,null,null,null,null,null,"Chiapas","07","Ocotepec","060"]
[null,null,null,null,null,null,null,null,null,"Chiapas","07","Ocozocoautla de Espinosa","061"]
[null,null,null,null,null,null,null,null,null,"Chiapas","07","Ostuacán","062"]
[null,null,null,null,null,null,null,null,null,"Chiapas","07","Osumacinta","063"]
[null,null,null,null,null,null,null,null,null,"Chiapas","07","Oxchuc","064"]
[null,null,null,null,null,null,null,null,null,"Chiapas","07","Palenque","065"]
[null,null,null,null,null,null,null,null,null,"Chiapas","07","Pantelhó","066"]
[null,null,null,null,null,null,null,null,null,"Chiapas","07","Pantepec","067"]
[null,null,null,null,null,null,null,null,null,"Chiapas","07","Pichucalco","068"]
[null,null,null,null,null,null,null,null,null,"Chiapas","07","Pijijiapan","069"]
[null,null,null,null,null,null,null,null,null,"Chiapas","07","El Porvenir","070"]
[null,null,null,null,null,null,null,null,null,"Chiapas","07","Villa Comaltitlán","071"]
[null,null,null,null,null,null,null,null,null,"Chiapas","07","Pueblo Nuevo Solistahuacán","072"]
[null,null,null,null,null,null,null,null,null,"Chiapas","07","Rayón","073"]
[null,null,null,null,null,null,null,null,null,"Chiapas","07","Reforma","074"]
[null,null,null,null,null,null,null,null,null,"Chiapas","07","Las Rosas","075"]
[null,null,null,null,null,null,null,null,null,"Chiapas","07","Sabanilla","076"]
[null,null,null,null,null,null,null,null,null,"Chiapas","07","Salto de Agua","077"]
[null,null,null,null,null,null,null,null,null,"Chiapas","07","San Cristóbal de las Casas","078"]
[null,null,null,null,null,null,null,null,null,"Chiapas","07","San Fernando","079"]
[null,null,null,null,null,null,null,null,null,"Chiapas","07","Siltepec","080"]
[null,null,null,null,null,null,null,null,null,"Chiapas","07","Simojovel","081"]
[null,null,null,null,null,null,null,null,null,"Chiapas","07","Sitalá","082"]
[null,null,null,null,null,null,null,null,null,"Chiapas","07","Socoltenango","083"]
[null,null,null,null,null,null,null,null,null,"Chiapas","07","Solosuchiapa","084"]
[null,null,null,null,null,null,null,null,null,"Chiapas","07","Soyaló","085"]
[null,null,null,null,null,null,null,null,null,"Chiapas","07","Suchiapa","086"]
[null,null,null,null,null,null,null,null,null,"Chiapas","07","Suchiate","087"]
[null,null,null,null,null,null,null,null,null,"Chiapas","07","Sunuapa","088"]
[null,null,null,null,null,null,null,null,null,"Chiapas","07","Tapachula","089"]
[null,null,null,null,null,null,null,null,null,"Chiapas","07","Tapalapa","090"]
[null,null,null,null,null,null,null,null,null,"Chiapas","07","Tapilula","091"]
[null,null,null,null,null,null,null,null,null,"Chiapas","07","Tecpatán","092"]
[null,null,null,null,null,null,null,null,null,"Chiapas","07","Tenejapa","093"]
[null,null,null,null,null,null,null,null,null,"Chiapas","07","Teopisca","094"]
[null,null,null,null,null,null,null,null,null,"Chiapas","07","Tila","096"]
[null,null,null,null,null,null,null,null,null,"Chiapas","07","Tonalá","097"]
[null,null,null,null,null,null,null,null,null,"Chiapas","07","Totolapa","098"]
[null,null,null,null,null,null,null,null,null,"Chiapas","07","La Trinitaria","099"]
[null,null,null,null,null,null,null,null,null,"Chiapas","07","Tumbalá",100]
[null,null,null,null,null,null,null,null,null,"Chiapas","07","Tuxtla Gutiérrez",101]
[null,null,null,null,null,null,null,null,null,"Chiapas","07","Tuxtla Chico",102]
[null,null,null,null,null,null,null,null,null,"Chiapas","07","Tuzantán",103]
[null,null,null,null,null,null,null,null,null,"Chiapas","07","Tzimol",104]
[null,null,null,null,null,null,null,null,null,"Chiapas","07","Unión Juárez",105]
[null,null,null,null,null,null,null,null,null,"Chiapas","07","Venustiano Carranza",106]
[null,null,null,null,null,null,null,null,null,"Chiapas","07","Villa Corzo",107]
[null,null,null,null,null,null,null,null,null,"Chiapas","07","Villaflores",108]
[null,null,null,null,null,null,null,null,null,"Chiapas","07","Yajalón",109]
[null,null,null,null,null,null,null,null,null,"Chiapas","07","San Lucas",110]
[null,null,null,null,null,null,null,null,null,"Chiapas","07","Zinacantán",111]
[null,null,null,null,null,null,null,null,null,"Chiapas","07","San Juan Cancuc",112]
[null,null,null,null,null,null,null,null,null,"Chiapas","07","Aldama",113]
[null,null,null,null,null,null,null,null,null,"Chiapas","07","Benemérito de las Américas",114]
[null,null,null,null,null,null,null,null,null,"Chiapas","07","Maravilla Tenejapa",115]
[null,null,null,null,null,null,null,null,null,"Chiapas","07","Marqués de Comillas",116]
[null,null,null,null,null,null,null,null,null,"Chiapas","07","Montecristo de Guerrero",117]
[null,null,null,null,null,null,null,null,null,"Chiapas","07","San Andrés Duraznal",118]
[null,null,null,null,null,null,null,null,null,"Chiapas","07","Santiago el Pinar",119]
[null,null,null,null,null,null,null,null,null,"Chiapas","07","Capitán Luis Ángel Vidal",120]
[null,null,null,null,null,null,null,null,null,"Chiapas","07","Rincón Chamula San Pedro",121]
[null,null,null,null,null,null,null,null,null,"Chiapas","07","El Parral",122]
[null,null,null,null,null,null,null,null,null,"Chiapas","07","Emiliano Zapata",123]
[null,null,null,null,null,null,null,null,null,"Chiapas","07","Mezcalapa",124]
[null,null,null,null,null,null,null,null,null,"Chiapas","07","Honduras de la Sierra",125]
[null,null,null,null,null,null,null,null,null,"Chiapas","07","Sin municipio identificado","999"]
[null,null,null,null,null,null,null,null,null,"Chihuahua","08","Ahumada","001"]
[null,null,null,null,null,null,null,null,null,"Chihuahua","08","Aldama","002"]
[null,null,null,null,null,null,null,null,null,"Chihuahua","08","Allende","003"]
[null,null,null,null,null,null,null,null,null,"Chihuahua","08","Aquiles Serdán","004"]
[null,null,null,null,null,null,null,null,null,"Chihuahua","08","Ascensión","005"]
[null,null,null,null,null,null,null,null,null,"Chihuahua","08","Bachíniva","006"]
[null,null,null,null,null,null,null,null,null,"Chihuahua","08","Balleza","007"]
[null,null,null,null,null,null,null,null,null,"Chihuahua","08","Batopilas de Manuel Gómez Morín","008"]
[null,null,null,null,null,null,null,null,null,"Chihuahua","08","Bocoyna","009"]
[null,null,null,null,null,null,null,null,null,"Chihuahua","08","Buenaventura","010"]
[null,null,null,null,null,null,null,null,null,"Chihuahua","08","Camargo","011"]
[null,null,null,null,null,null,null,null,null,"Chihuahua","08","Carichí","012"]
[null,null,null,null,null,null,null,null,null,"Chihuahua","08","Casas Grandes","013"]
[null,null,null,null,null,null,null,null,null,"Chihuahua","08","Coronado","014"]
[null,null,null,null,null,null,null,null,null,"Chihuahua","08","Coyame del Sotol","015"]
[null,null,null,null,null,null,null,null,null,"Chihuahua","08","La Cruz","016"]
[null,null,null,null,null,null,null,null,null,"Chihuahua","08","Cuauhtémoc","017"]
[null,null,null,null,null,null,null,null,null,"Chihuahua","08","Cusihuiriachi","018"]
[null,null,null,null,null,null,null,null,null,"Chihuahua","08","Chihuahua","019"]
[null,null,null,null,null,null,null,null,null,"Chihuahua","08","Chínipas","020"]
[null,null,null,null,null,null,null,null,null,"Chihuahua","08","Delicias","021"]
[null,null,null,null,null,null,null,null,null,"Chihuahua","08","Dr. Belisario Domínguez","022"]
[null,null,null,null,null,null,null,null,null,"Chihuahua","08","Galeana","023"]
[null,null,null,null,null,null,null,null,null,"Chihuahua","08","Santa Isabel","024"]
[null,null,null,null,null,null,null,null,null,"Chihuahua","08","Gómez Farías","025"]
[null,null,null,null,null,null,null,null,null,"Chihuahua","08","Gran Morelos","026"]
[null,null,null,null,null,null,null,null,null,"Chihuahua","08","Guachochi","027"]
[null,null,null,null,null,null,null,null,null,"Chihuahua","08","Guadalupe","028"]
[null,null,null,null,null,null,null,null,null,"Chihuahua","08","Guadalupe y Calvo","029"]
[null,null,null,null,null,null,null,null,null,"Chihuahua","08","Guazapares","030"]
[null,null,null,null,null,null,null,null,null,"Chihuahua","08","Guerrero","031"]
[null,null,null,null,null,null,null,null,null,"Chihuahua","08","Hidalgo del Parral","032"]
[null,null,null,null,null,null,null,null,null,"Chihuahua","08","Huejotitán","033"]
[null,null,null,null,null,null,null,null,null,"Chihuahua","08","Ignacio Zaragoza","034"]
[null,null,null,null,null,null,null,null,null,"Chihuahua","08","Janos","035"]
[null,null,null,null,null,null,null,null,null,"Chihuahua","08","Jiménez","036"]
[null,null,null,null,null,null,null,null,null,"Chihuahua","08","Juárez","037"]
[null,null,null,null,null,null,null,null,null,"Chihuahua","08","Julimes","038"]
[null,null,null,null,null,null,null,null,null,"Chihuahua","08","López","039"]
[null,null,null,null,null,null,null,null,null,"Chihuahua","08","Madera","040"]
[null,null,null,null,null,null,null,null,null,"Chihuahua","08","Maguarichi","041"]
[null,null,null,null,null,null,null,null,null,"Chihuahua","08","Manuel Benavides","042"]
[null,null,null,null,null,null,null,null,null,"Chihuahua","08","Matachí","043"]
[null,null,null,null,null,null,null,null,null,"Chihuahua","08","Matamoros","044"]
[null,null,null,null,null,null,null,null,null,"Chihuahua","08","Meoqui","045"]
[null,null,null,null,null,null,null,null,null,"Chihuahua","08","Morelos","046"]
[null,null,null,null,null,null,null,null,null,"Chihuahua","08","Moris","047"]
[null,null,null,null,null,null,null,null,null,"Chihuahua","08","Namiquipa","048"]
[null,null,null,null,null,null,null,null,null,"Chihuahua","08","Nonoava","049"]
[null,null,null,null,null,null,null,null,null,"Chihuahua","08","Nuevo Casas Grandes","050"]
[null,null,null,null,null,null,null,null,null,"Chihuahua","08","Ocampo","051"]
[null,null,null,null,null,null,null,null,null,"Chihuahua","08","Ojinaga","052"]
[null,null,null,null,null,null,null,null,null,"Chihuahua","08","Praxedis G. Guerrero","053"]
[null,null,null,null,null,null,null,null,null,"Chihuahua","08","Riva Palacio","054"]
[null,null,null,null,null,null,null,null,null,"Chihuahua","08","Rosales","055"]
[null,null,null,null,null,null,null,null,null,"Chihuahua","08","Valle del Rosario","056"]
[null,null,null,null,null,null,null,null,null,"Chihuahua","08","San Francisco de Borja","057"]
[null,null,null,null,null,null,null,null,null,"Chihuahua","08","San Francisco de Conchos","058"]
[null,null,null,null,null,null,null,null,null,"Chihuahua","08","San Francisco del Oro","059"]
[null,null,null,null,null,null,null,null,null,"Chihuahua","08","Santa Bárbara","060"]
[null,null,null,null,null,null,null,null,null,"Chihuahua","08","Satevó","061"]
[null,null,null,null,null,null,null,null,null,"Chihuahua","08","Saucillo","062"]
[null,null,null,null,null,null,null,null,null,"Chihuahua","08","Temósachic","063"]
[null,null,null,null,null,null,null,null,null,"Chihuahua","08","El Tule","064"]
[null,null,null,null,null,null,null,null,null,"Chihuahua","08","Urique","065"]
[null,null,null,null,null,null,null,null,null,"Chihuahua","08","Uruachi","066"]
[null,null,null,null,null,null,null,null,null,"Chihuahua","08","Valle de Zaragoza","067"]
[null,null,null,null,null,null,null,null,null,"Chihuahua","08","Sin municipio identificado","999"]
[null,null,null,null,null,null,null,null,null,"Ciudad de México","09","Azcapotzalco","002"]
[null,null,null,null,null,null,null,null,null,"Ciudad de México","09","Coyoacán","003"]
[null,null,null,null,null,null,null,null,null,"Ciudad de México","09","Cuajimalpa de Morelos","004"]
[null,null,null,null,null,null,null,null,null,"Ciudad de México","09","Gustavo A. Madero","005"]
[null,null,null,null,null,null,null,null,null,"Ciudad de México","09","Iztacalco","006"]
[null,null,null,null,null,null,null,null,null,"Ciudad de México","09","Iztapalapa","007"]
[null,null,null,null,null,null,null,null,null,"Ciudad de México","09","La Magdalena Contreras","008"]
[null,null,null,null,null,null,null,null,null,"Ciudad de México","09","Milpa Alta","009"]
[null,null,null,null,null,null,null,null,null,"Ciudad de México","09","Álvaro Obregón","010"]
[null,null,null,null,null,null,null,null,null,"Ciudad de México","09","Tláhuac","011"]
[null,null,null,null,null,null,null,null,null,"Ciudad de México","09","Tlalpan","012"]
[null,null,null,null,null,null,null,null,null,"Ciudad de México","09","Xochimilco","013"]
[null,null,null,null,null,null,null,null,null,"Ciudad de México","09","Benito Juárez","014"]
[null,null,null,null,null,null,null,null,null,"Ciudad de México","09","Cuauhtémoc","015"]
[null,null,null,null,null,null,null,null,null,"Ciudad de México","09","Miguel Hidalgo","016"]
[null,null,null,null,null,null,null,null,null,"Ciudad de México","09","Venustiano Carranza","017"]
[null,null,null,null,null,null,null,null,null,"Ciudad de México","09","Sin municipio identificado","999"]
[null,null,null,null,null,null,null,null,null,"Durango",10,"Canatlán","001"]
[null,null,null,null,null,null,null,null,null,"Durango",10,"Canelas","002"]
[null,null,null,null,null,null,null,null,null,"Durango",10,"Coneto de Comonfort","003"]
[null,null,null,null,null,null,null,null,null,"Durango",10,"Cuencamé","004"]
[null,null,null,null,null,null,null,null,null,"Durango",10,"Durango","005"]
[null,null,null,null,null,null,null,null,null,"Durango",10,"General Simón Bolívar","006"]
[null,null,null,null,null,null,null,null,null,"Durango",10,"Gómez Palacio","007"]
[null,null,null,null,null,null,null,null,null,"Durango",10,"Guadalupe Victoria","008"]
[null,null,null,null,null,null,null,null,null,"Durango",10,"Guanaceví","009"]
[null,null,null,null,null,null,null,null,null,"Durango",10,"Hidalgo","010"]
[null,null,null,null,null,null,null,null,null,"Durango",10,"Indé","011"]
[null,null,null,null,null,null,null,null,null,"Durango",10,"Lerdo","012"]
[null,null,null,null,null,null,null,null,null,"Durango",10,"Mapimí","013"]
[null,null,null,null,null,null,null,null,null,"Durango",10,"Mezquital","014"]
[null,null,null,null,null,null,null,null,null,"Durango",10,"Nazas","015"]
[null,null,null,null,null,null,null,null,null,"Durango",10,"Nombre de Dios","016"]
[null,null,null,null,null,null,null,null,null,"Durango",10,"Ocampo","017"]
[null,null,null,null,null,null,null,null,null,"Durango",10,"El Oro","018"]
[null,null,null,null,null,null,null,null,null,"Durango",10,"Otáez","019"]
[null,null,null,null,null,null,null,null,null,"Durango",10,"Pánuco de Coronado","020"]
[null,null,null,null,null,null,null,null,null,"Durango",10,"Peñón Blanco","021"]
[null,null,null,null,null,null,null,null,null,"Durango",10,"Poanas","022"]
[null,null,null,null,null,null,null,null,null,"Durango",10,"Pueblo Nuevo","023"]
[null,null,null,null,null,null,null,null,null,"Durango",10,"Rodeo","024"]
[null,null,null,null,null,null,null,null,null,"Durango",10,"San Bernardo","025"]
[null,null,null,null,null,null,null,null,null,"Durango",10,"San Dimas","026"]
[null,null,null,null,null,null,null,null,null,"Durango",10,"San Juan de Guadalupe","027"]
[null,null,null,null,null,null,null,null,null,"Durango",10,"San Juan del Río","028"]
[null,null,null,null,null,null,null,null,null,"Durango",10,"San Luis del Cordero","029"]
[null,null,null,null,null,null,null,null,null,"Durango",10,"San Pedro del Gallo","030"]
[null,null,null,null,null,null,null,null,null,"Durango",10,"Santa Clara","031"]
[null,null,null,null,null,null,null,null,null,"Durango",10,"Santiago Papasquiaro","032"]
[null,null,null,null,null,null,null,null,null,"Durango",10,"Súchil","033"]
[null,null,null,null,null,null,null,null,null,"Durango",10,"Tamazula","034"]
[null,null,null,null,null,null,null,null,null,"Durango",10,"Tepehuanes","035"]
[null,null,null,null,null,null,null,null,null,"Durango",10,"Tlahualilo","036"]
[null,null,null,null,null,null,null,null,null,"Durango",10,"Topia","037"]
[null,null,null,null,null,null,null,null,null,"Durango",10,"Vicente Guerrero","038"]
[null,null,null,null,null,null,null,null,null,"Durango",10,"Nuevo Ideal","039"]
[null,null,null,null,null,null,null,null,null,"Durango",10,"Sin municipio identificado","999"]
[null,null,null,null,null,null,null,null,null,"Guanajuato",11,"Abasolo","001"]
[null,null,null,null,null,null,null,null,null,"Guanajuato",11,"Acámbaro","002"]
[null,null,null,null,null,null,null,null,null,"Guanajuato",11,"San Miguel de Allende","003"]
[null,null,null,null,null,null,null,null,null,"Guanajuato",11,"Apaseo el Alto","004"]
[null,null,null,null,null,null,null,null,null,"Guanajuato",11,"Apaseo el Grande","005"]
[null,null,null,null,null,null,null,null,null,"Guanajuato",11,"Atarjea","006"]
[null,null,null,null,null,null,null,null,null,"Guanajuato",11,"Celaya","007"]
[null,null,null,null,null,null,null,null,null,"Guanajuato",11,"Manuel Doblado","008"]
[null,null,null,null,null,null,null,null,null,"Guanajuato",11,"Comonfort","009"]
[null,null,null,null,null,null,null,null,null,"Guanajuato",11,"Coroneo","010"]
[null,null,null,null,null,null,null,null,null,"Guanajuato",11,"Cortazar","011"]
[null,null,null,null,null,null,null,null,null,"Guanajuato",11,"Cuerámaro","012"]
[null,null,null,null,null,null,null,null,null,"Guanajuato",11,"Doctor Mora","013"]
[null,null,null,null,null,null,null,null,null,"Guanajuato",11,"Dolores Hidalgo Cuna de la Independencia Nacional","014"]
[null,null,null,null,null,null,null,null,null,"Guanajuato",11,"Guanajuato","015"]
[null,null,null,null,null,null,null,null,null,"Guanajuato",11,"Huanímaro","016"]
[null,null,null,null,null,null,null,null,null,"Guanajuato",11,"Irapuato","017"]
[null,null,null,null,null,null,null,null,null,"Guanajuato",11,"Jaral del Progreso","018"]
[null,null,null,null,null,null,null,null,null,"Guanajuato",11,"Jerécuaro","019"]
[null,null,null,null,null,null,null,null,null,"Guanajuato",11,"León","020"]
[null,null,null,null,null,null,null,null,null,"Guanajuato",11,"Moroleón","021"]
[null,null,null,null,null,null,null,null,null,"Guanajuato",11,"Ocampo","022"]
[null,null,null,null,null,null,null,null,null,"Guanajuato",11,"Pénjamo","023"]
[null,null,null,null,null,null,null,null,null,"Guanajuato",11,"Pueblo Nuevo","024"]
[null,null,null,null,null,null,null,null,null,"Guanajuato",11,"Purísima del Rincón","025"]
[null,null,null,null,null,null,null,null,null,"Guanajuato",11,"Romita","026"]
[null,null,null,null,null,null,null,null,null,"Guanajuato",11,"Salamanca","027"]
[null,null,null,null,null,null,null,null,null,"Guanajuato",11,"Salvatierra","028"]
[null,null,null,null,null,null,null,null,null,"Guanajuato",11,"San Diego de la Unión","029"]
[null,null,null,null,null,null,null,null,null,"Guanajuato",11,"San Felipe","030"]
[null,null,null,null,null,null,null,null,null,"Guanajuato",11,"San Francisco del Rincón","031"]
[null,null,null,null,null,null,null,null,null,"Guanajuato",11,"San José de Iturbide","032"]
[null,null,null,null,null,null,null,null,null,"Guanajuato",11,"San Luis de la Paz","033"]
[null,null,null,null,null,null,null,null,null,"Guanajuato",11,"Santa Catarina","034"]
[null,null,null,null,null,null,null,null,null,"Guanajuato",11,"Santa Cruz de Juventino Rosas","035"]
[null,null,null,null,null,null,null,null,null,"Guanajuato",11,"Santiago Maravatío","036"]
[null,null,null,null,null,null,null,null,null,"Guanajuato",11,"Silao de la Victoria","037"]
[null,null,null,null,null,null,null,null,null,"Guanajuato",11,"Tarandacuao","038"]
[null,null,null,null,null,null,null,null,null,"Guanajuato",11,"Tarimoro","039"]
[null,null,null,null,null,null,null,null,null,"Guanajuato",11,"Tierra Blanca","040"]
[null,null,null,null,null,null,null,null,null,"Guanajuato",11,"Uriangato","041"]
[null,null,null,null,null,null,null,null,null,"Guanajuato",11,"Valle de Santiago","042"]
[null,null,null,null,null,null,null,null,null,"Guanajuato",11,"Victoria","043"]
[null,null,null,null,null,null,null,null,null,"Guanajuato",11,"Villagrán","044"]
[null,null,null,null,null,null,null,null,null,"Guanajuato",11,"Xichú","045"]
[null,null,null,null,null,null,null,null,null,"Guanajuato",11,"Yuriria","046"]
[null,null,null,null,null,null,null,null,null,"Guanajuato",11,"Sin municipio identificado","999"]
[null,null,null,null,null,null,null,null,null,"Guerrero",12,"Acapulco de Juárez","001"]
[null,null,null,null,null,null,null,null,null,"Guerrero",12,"Ahuacuotzingo","002"]
[null,null,null,null,null,null,null,null,null,"Guerrero",12,"Ajuchitlán del Progreso","003"]
[null,null,null,null,null,null,null,null,null,"Guerrero",12,"Alcozauca de Guerrero","004"]
[null,null,null,null,null,null,null,null,null,"Guerrero",12,"Alpoyeca","005"]
[null,null,null,null,null,null,null,null,null,"Guerrero",12,"Apaxtla de Castrejón","006"]
[null,null,null,null,null,null,null,null,null,"Guerrero",12,"Arcelia","007"]
[null,null,null,null,null,null,null,null,null,"Guerrero",12,"Atenango del Río","008"]
[null,null,null,null,null,null,null,null,null,"Guerrero",12,"Atlamajalcingo del Monte","009"]
[null,null,null,null,null,null,null,null,null,"Guerrero",12,"Atlixtac","010"]
[null,null,null,null,null,null,null,null,null,"Guerrero",12,"Atoyac de Álvarez","011"]
[null,null,null,null,null,null,null,null,null,"Guerrero",12,"Ayutla de los Libres","012"]
[null,null,null,null,null,null,null,null,null,"Guerrero",12,"Azoyú","013"]
[null,null,null,null,null,null,null,null,null,"Guerrero",12,"Benito Juárez","014"]
[null,null,null,null,null,null,null,null,null,"Guerrero",12,"Buenavista de Cuéllar","015"]
[null,null,null,null,null,null,null,null,null,"Guerrero",12,"Coahuayutla de José María Izazaga","016"]
[null,null,null,null,null,null,null,null,null,"Guerrero",12,"Cocula","017"]
[null,null,null,null,null,null,null,null,null,"Guerrero",12,"Copala","018"]
[null,null,null,null,null,null,null,null,null,"Guerrero",12,"Copalillo","019"]
[null,null,null,null,null,null,null,null,null,"Guerrero",12,"Copanatoyac","020"]
[null,null,null,null,null,null,null,null,null,"Guerrero",12,"Coyuca de Benítez","021"]
[null,null,null,null,null,null,null,null,null,"Guerrero",12,"Coyuca de Catalán","022"]
[null,null,null,null,null,null,null,null,null,"Guerrero",12,"Cuajinicuilapa","023"]
[null,null,null,null,null,null,null,null,null,"Guerrero",12,"Cualác","024"]
[null,null,null,null,null,null,null,null,null,"Guerrero",12,"Cuautepec","025"]
[null,null,null,null,null,null,null,null,null,"Guerrero",12,"Cuetzala del Progreso","026"]
[null,null,null,null,null,null,null,null,null,"Guerrero",12,"Cutzamala de Pinzón","027"]
[null,null,null,null,null,null,null,null,null,"Guerrero",12,"Chilapa de Álvarez","028"]
[null,null,null,null,null,null,null,null,null,"Guerrero",12,"Chilpancingo de los Bravo","029"]
[null,null,null,null,null,null,null,null,null,"Guerrero",12,"Florencio Villarreal","030"]
[null,null,null,null,null,null,null,null,null,"Guerrero",12,"General Canuto A. Neri","031"]
[null,null,null,null,null,null,null,null,null,"Guerrero",12,"General Heliodoro Castillo","032"]
[null,null,null,null,null,null,null,null,null,"Guerrero",12,"Huamuxtitlán","033"]
[null,null,null,null,null,null,null,null,null,"Guerrero",12,"Huitzuco de los Figueroa","034"]
[null,null,null,null,null,null,null,null,null,"Guerrero",12,"Iguala de la Independencia","035"]
[null,null,null,null,null,null,null,null,null,"Guerrero",12,"Igualapa","036"]
[null,null,null,null,null,null,null,null,null,"Guerrero",12,"Ixcateopan de Cuauhtémoc","037"]
[null,null,null,null,null,null,null,null,null,"Guerrero",12,"Zihuatanejo de Azueta","038"]
[null,null,null,null,null,null,null,null,null,"Guerrero",12,"Juan R. Escudero","039"]
[null,null,null,null,null,null,null,null,null,"Guerrero",12,"Leonardo Bravo","040"]
[null,null,null,null,null,null,null,null,null,"Guerrero",12,"Malinaltepec","041"]
[null,null,null,null,null,null,null,null,null,"Guerrero",12,"Mártir de Cuilapan","042"]
[null,null,null,null,null,null,null,null,null,"Guerrero",12,"Metlatónoc","043"]
[null,null,null,null,null,null,null,null,null,"Guerrero",12,"Mochitlán","044"]
[null,null,null,null,null,null,null,null,null,"Guerrero",12,"Olinalá","045"]
[null,null,null,null,null,null,null,null,null,"Guerrero",12,"Ometepec","046"]
[null,null,null,null,null,null,null,null,null,"Guerrero",12,"Pedro Ascencio Alquisiras","047"]
[null,null,null,null,null,null,null,null,null,"Guerrero",12,"Petatlán","048"]
[null,null,null,null,null,null,null,null,null,"Guerrero",12,"Pilcaya","049"]
[null,null,null,null,null,null,null,null,null,"Guerrero",12,"Pungarabato","050"]
[null,null,null,null,null,null,null,null,null,"Guerrero",12,"Quechultenango","051"]
[null,null,null,null,null,null,null,null,null,"Guerrero",12,"San Luis Acatlán","052"]
[null,null,null,null,null,null,null,null,null,"Guerrero",12,"San Marcos","053"]
[null,null,null,null,null,null,null,null,null,"Guerrero",12,"San Miguel Totolapan","054"]
[null,null,null,null,null,null,null,null,null,"Guerrero",12,"Taxco de Alarcón","055"]
[null,null,null,null,null,null,null,null,null,"Guerrero",12,"Tecoanapa","056"]
[null,null,null,null,null,null,null,null,null,"Guerrero",12,"Técpan de Galeana","057"]
[null,null,null,null,null,null,null,null,null,"Guerrero",12,"Teloloapan","058"]
[null,null,null,null,null,null,null,null,null,"Guerrero",12,"Tepecoacuilco de Trujano","059"]
[null,null,null,null,null,null,null,null,null,"Guerrero",12,"Tetipac","060"]
[null,null,null,null,null,null,null,null,null,"Guerrero",12,"Tixtla de Guerrero","061"]
[null,null,null,null,null,null,null,null,null,"Guerrero",12,"Tlacoachistlahuaca","062"]
[null,null,null,null,null,null,null,null,null,"Guerrero",12,"Tlacoapa","063"]
[null,null,null,null,null,null,null,null,null,"Guerrero",12,"Tlalchapa","064"]
[null,null,null,null,null,null,null,null,null,"Guerrero",12,"Tlalixtaquilla de Maldonado","065"]
[null,null,null,null,null,null,null,null,null,"Guerrero",12,"Tlapa de Comonfort","066"]
[null,null,null,null,null,null,null,null,null,"Guerrero",12,"Tlapehuala","067"]
[null,null,null,null,null,null,null,null,null,"Guerrero",12,"La Unión de Isidoro Montes de Oca","068"]
[null,null,null,null,null,null,null,null,null,"Guerrero",12,"Xalpatláhuac","069"]
[null,null,null,null,null,null,null,null,null,"Guerrero",12,"Xochihuehuetlán","070"]
[null,null,null,null,null,null,null,null,null,"Guerrero",12,"Xochistlahuaca","071"]
[null,null,null,null,null,null,null,null,null,"Guerrero",12,"Zapotitlán Tablas","072"]
[null,null,null,null,null,null,null,null,null,"Guerrero",12,"Zirándaro","073"]
[null,null,null,null,null,null,null,null,null,"Guerrero",12,"Zitlala","074"]
[null,null,null,null,null,null,null,null,null,"Guerrero",12,"Eduardo Neri","075"]
[null,null,null,null,null,null,null,null,null,"Guerrero",12,"Acatepec","076"]
[null,null,null,null,null,null,null,null,null,"Guerrero",12,"Marquelia","077"]
[null,null,null,null,null,null,null,null,null,"Guerrero",12,"Cochoapa el Grande","078"]
[null,null,null,null,null,null,null,null,null,"Guerrero",12,"José Joaquín de Herrera","079"]
[null,null,null,null,null,null,null,null,null,"Guerrero",12,"Juchitán","080"]
[null,null,null,null,null,null,null,null,null,"Guerrero",12,"Iliatenco","081"]
[null,null,null,null,null,null,null,null,null,"Guerrero",12,"Las Vigas","082"]
[null,null,null,null,null,null,null,null,null,"Guerrero",12,"Ñuu Savi","083"]
[null,null,null,null,null,null,null,null,null,"Guerrero",12,"Santa Cruz del Rincón","084"]
[null,null,null,null,null,null,null,null,null,"Guerrero",12,"San Nicolás","085"]
[null,null,null,null,null,null,null,null,null,"Guerrero",12,"Sin municipio identificado","999"]
[null,null,null,null,null,null,null,null,null,"Hidalgo",13,"Acatlán","001"]
[null,null,null,null,null,null,null,null,null,"Hidalgo",13,"Acaxochitlán","002"]
[null,null,null,null,null,null,null,null,null,"Hidalgo",13,"Actopan","003"]
[null,null,null,null,null,null,null,null,null,"Hidalgo",13,"Agua Blanca de Iturbide","004"]
[null,null,null,null,null,null,null,null,null,"Hidalgo",13,"Ajacuba","005"]
[null,null,null,null,null,null,null,null,null,"Hidalgo",13,"Alfajayucan","006"]
[null,null,null,null,null,null,null,null,null,"Hidalgo",13,"Almoloya","007"]
[null,null,null,null,null,null,null,null,null,"Hidalgo",13,"Apan","008"]
[null,null,null,null,null,null,null,null,null,"Hidalgo",13,"El Arenal","009"]
[null,null,null,null,null,null,null,null,null,"Hidalgo",13,"Atitalaquia","010"]
[null,null,null,null,null,null,null,null,null,"Hidalgo",13,"Atlapexco","011"]
[null,null,null,null,null,null,null,null,null,"Hidalgo",13,"Atotonilco el Grande","012"]
[null,null,null,null,null,null,null,null,null,"Hidalgo",13,"Atotonilco de Tula","013"]
[null,null,null,null,null,null,null,null,null,"Hidalgo",13,"Calnali","014"]
[null,null,null,null,null,null,null,null,null,"Hidalgo",13,"Cardonal","015"]
[null,null,null,null,null,null,null,null,null,"Hidalgo",13,"Cuautepec de Hinojosa","016"]
[null,null,null,null,null,null,null,null,null,"Hidalgo",13,"Chapantongo","017"]
[null,null,null,null,null,null,null,null,null,"Hidalgo",13,"Chapulhuacán","018"]
[null,null,null,null,null,null,null,null,null,"Hidalgo",13,"Chilcuautla","019"]
[null,null,null,null,null,null,null,null,null,"Hidalgo",13,"Eloxochitlán","020"]
[null,null,null,null,null,null,null,null,null,"Hidalgo",13,"Emiliano Zapata","021"]
[null,null,null,null,null,null,null,null,null,"Hidalgo",13,"Epazoyucan","022"]
[null,null,null,null,null,null,null,null,null,"Hidalgo",13,"Francisco I. Madero","023"]
[null,null,null,null,null,null,null,null,null,"Hidalgo",13,"Huasca de Ocampo","024"]
[null,null,null,null,null,null,null,null,null,"Hidalgo",13,"Huautla","025"]
[null,null,null,null,null,null,null,null,null,"Hidalgo",13,"Huazalingo","026"]
[null,null,null,null,null,null,null,null,null,"Hidalgo",13,"Huehuetla","027"]
[null,null,null,null,null,null,null,null,null,"Hidalgo",13,"Huejutla de Reyes","028"]
[null,null,null,null,null,null,null,null,null,"Hidalgo",13,"Huichapan","029"]
[null,null,null,null,null,null,null,null,null,"Hidalgo",13,"Ixmiquilpan","030"]
[null,null,null,null,null,null,null,null,null,"Hidalgo",13,"Jacala de Ledezma","031"]
[null,null,null,null,null,null,null,null,null,"Hidalgo",13,"Jaltocán","032"]
[null,null,null,null,null,null,null,null,null,"Hidalgo",13,"Juárez Hidalgo","033"]
[null,null,null,null,null,null,null,null,null,"Hidalgo",13,"Lolotla","034"]
[null,null,null,null,null,null,null,null,null,"Hidalgo",13,"Metepec","035"]
[null,null,null,null,null,null,null,null,null,"Hidalgo",13,"San Agustín Metzquititlán","036"]
[null,null,null,null,null,null,null,null,null,"Hidalgo",13,"Metztitlán","037"]
[null,null,null,null,null,null,null,null,null,"Hidalgo",13,"Mineral del Chico","038"]
[null,null,null,null,null,null,null,null,null,"Hidalgo",13,"Mineral del Monte","039"]
[null,null,null,null,null,null,null,null,null,"Hidalgo",13,"La Misión","040"]
[null,null,null,null,null,null,null,null,null,"Hidalgo",13,"Mixquiahuala de Juárez","041"]
[null,null,null,null,null,null,null,null,null,"Hidalgo",13,"Molango de Escamilla","042"]
[null,null,null,null,null,null,null,null,null,"Hidalgo",13,"Nicolás Flores","043"]
[null,null,null,null,null,null,null,null,null,"Hidalgo",13,"Nopala de Villagrán","044"]
[null,null,null,null,null,null,null,null,null,"Hidalgo",13,"Omitlán de Juárez","045"]
[null,null,null,null,null,null,null,null,null,"Hidalgo",13,"San Felipe Orizatlán","046"]
[null,null,null,null,null,null,null,null,null,"Hidalgo",13,"Pacula","047"]
[null,null,null,null,null,null,null,null,null,"Hidalgo",13,"Pachuca de Soto","048"]
[null,null,null,null,null,null,null,null,null,"Hidalgo",13,"Pisaflores","049"]
[null,null,null,null,null,null,null,null,null,"Hidalgo",13,"Progreso de Obregón","050"]
[null,null,null,null,null,null,null,null,null,"Hidalgo",13,"Mineral de la Reforma","051"]
[null,null,null,null,null,null,null,null,null,"Hidalgo",13,"San Agustín Tlaxiaca","052"]
[null,null,null,null,null,null,null,null,null,"Hidalgo",13,"San Bartolo Tutotepec","053"]
[null,null,null,null,null,null,null,null,null,"Hidalgo",13,"San Salvador","054"]
[null,null,null,null,null,null,null,null,null,"Hidalgo",13,"Santiago de Anaya","055"]
[null,null,null,null,null,null,null,null,null,"Hidalgo",13,"Santiago Tulantepec de Lugo Guerrero","056"]
[null,null,null,null,null,null,null,null,null,"Hidalgo",13,"Singuilucan","057"]
[null,null,null,null,null,null,null,null,null,"Hidalgo",13,"Tasquillo","058"]
[null,null,null,null,null,null,null,null,null,"Hidalgo",13,"Tecozautla","059"]
[null,null,null,null,null,null,null,null,null,"Hidalgo",13,"Tenango de Doria","060"]
[null,null,null,null,null,null,null,null,null,"Hidalgo",13,"Tepeapulco","061"]
[null,null,null,null,null,null,null,null,null,"Hidalgo",13,"Tepehuacán de Guerrero","062"]
[null,null,null,null,null,null,null,null,null,"Hidalgo",13,"Tepeji del Río de Ocampo","063"]
[null,null,null,null,null,null,null,null,null,"Hidalgo",13,"Tepetitlán","064"]
[null,null,null,null,null,null,null,null,null,"Hidalgo",13,"Tetepango","065"]
[null,null,null,null,null,null,null,null,null,"Hidalgo",13,"Villa de Tezontepec","066"]
[null,null,null,null,null,null,null,null,null,"Hidalgo",13,"Tezontepec de Aldama","067"]
[null,null,null,null,null,null,null,null,null,"Hidalgo",13,"Tianguistengo","068"]
[null,null,null,null,null,null,null,null,null,"Hidalgo",13,"Tizayuca","069"]
[null,null,null,null,null,null,null,null,null,"Hidalgo",13,"Tlahuelilpan","070"]
[null,null,null,null,null,null,null,null,null,"Hidalgo",13,"Tlahuiltepa","071"]
[null,null,null,null,null,null,null,null,null,"Hidalgo",13,"Tlanalapa","072"]
[null,null,null,null,null,null,null,null,null,"Hidalgo",13,"Tlanchinol","073"]
[null,null,null,null,null,null,null,null,null,"Hidalgo",13,"Tlaxcoapan","074"]
[null,null,null,null,null,null,null,null,null,"Hidalgo",13,"Tolcayuca","075"]
[null,null,null,null,null,null,null,null,null,"Hidalgo",13,"Tula de Allende","076"]
[null,null,null,null,null,null,null,null,null,"Hidalgo",13,"Tulancingo de Bravo","077"]
[null,null,null,null,null,null,null,null,null,"Hidalgo",13,"Xochiatipan","078"]
[null,null,null,null,null,null,null,null,null,"Hidalgo",13,"Xochicoatlán","079"]
[null,null,null,null,null,null,null,null,null,"Hidalgo",13,"Yahualica","080"]
[null,null,null,null,null,null,null,null,null,"Hidalgo",13,"Zacualtipán de Ángeles","081"]
[null,null,null,null,null,null,null,null,null,"Hidalgo",13,"Zapotlán de Juárez","082"]
[null,null,null,null,null,null,null,null,null,"Hidalgo",13,"Zempoala","083"]
[null,null,null,null,null,null,null,null,null,"Hidalgo",13,"Zimapán","084"]
[null,null,null,null,null,null,null,null,null,"Hidalgo",13,"Sin municipio identificado","999"]
[null,null,null,null,null,null,null,null,null,"Jalisco",14,"Acatic","001"]
[null,null,null,null,null,null,null,null,null,"Jalisco",14,"Acatlán de Juárez","002"]
[null,null,null,null,null,null,null,null,null,"Jalisco",14,"Ahualulco de Mercado","003"]
[null,null,null,null,null,null,null,null,null,"Jalisco",14,"Amacueca","004"]
[null,null,null,null,null,null,null,null,null,"Jalisco",14,"Amatitán","005"]
[null,null,null,null,null,null,null,null,null,"Jalisco",14,"Ameca","006"]
[null,null,null,null,null,null,null,null,null,"Jalisco",14,"San Juanito de Escobedo","007"]
[null,null,null,null,null,null,null,null,null,"Jalisco",14,"Arandas","008"]
[null,null,null,null,null,null,null,null,null,"Jalisco",14,"El Arenal","009"]
[null,null,null,null,null,null,null,null,null,"Jalisco",14,"Atemajac de Brizuela","010"]
[null,null,null,null,null,null,null,null,null,"Jalisco",14,"Atengo","011"]
[null,null,null,null,null,null,null,null,null,"Jalisco",14,"Atenguillo","012"]
[null,null,null,null,null,null,null,null,null,"Jalisco",14,"Atotonilco el Alto","013"]
[null,null,null,null,null,null,null,null,null,"Jalisco",14,"Atoyac","014"]
[null,null,null,null,null,null,null,null,null,"Jalisco",14,"Autlán de Navarro","015"]
[null,null,null,null,null,null,null,null,null,"Jalisco",14,"Ayotlán","016"]
[null,null,null,null,null,null,null,null,null,"Jalisco",14,"Ayutla","017"]
[null,null,null,null,null,null,null,null,null,"Jalisco",14,"La Barca","018"]
[null,null,null,null,null,null,null,null,null,"Jalisco",14,"Bolaños","019"]
[null,null,null,null,null,null,null,null,null,"Jalisco",14,"Cabo Corrientes","020"]
[null,null,null,null,null,null,null,null,null,"Jalisco",14,"Casimiro Castillo","021"]
[null,null,null,null,null,null,null,null,null,"Jalisco",14,"Cihuatlán","022"]
[null,null,null,null,null,null,null,null,null,"Jalisco",14,"Zapotlán el Grande","023"]
[null,null,null,null,null,null,null,null,null,"Jalisco",14,"Cocula","024"]
[null,null,null,null,null,null,null,null,null,"Jalisco",14,"Colotlán","025"]
[null,null,null,null,null,null,null,null,null,"Jalisco",14,"Concepción de Buenos Aires","026"]
[null,null,null,null,null,null,null,null,null,"Jalisco",14,"Cuautitlán de García Barragán","027"]
[null,null,null,null,null,null,null,null,null,"Jalisco",14,"Cuautla","028"]
[null,null,null,null,null,null,null,null,null,"Jalisco",14,"Cuquío","029"]
[null,null,null,null,null,null,null,null,null,"Jalisco",14,"Chapala","030"]
[null,null,null,null,null,null,null,null,null,"Jalisco",14,"Chimaltitán","031"]
[null,null,null,null,null,null,null,null,null,"Jalisco",14,"Chiquilistlán","032"]
[null,null,null,null,null,null,null,null,null,"Jalisco",14,"Degollado","033"]
[null,null,null,null,null,null,null,null,null,"Jalisco",14,"Ejutla","034"]
[null,null,null,null,null,null,null,null,null,"Jalisco",14,"Encarnación de Díaz","035"]
[null,null,null,null,null,null,null,null,null,"Jalisco",14,"Etzatlán","036"]
[null,null,null,null,null,null,null,null,null,"Jalisco",14,"El Grullo","037"]
[null,null,null,null,null,null,null,null,null,"Jalisco",14,"Guachinango","038"]
[null,null,null,null,null,null,null,null,null,"Jalisco",14,"Guadalajara","039"]
[null,null,null,null,null,null,null,null,null,"Jalisco",14,"Hostotipaquillo","040"]
[null,null,null,null,null,null,null,null,null,"Jalisco",14,"Huejúcar","041"]
[null,null,null,null,null,null,null,null,null,"Jalisco",14,"Huejuquilla el Alto","042"]
[null,null,null,null,null,null,null,null,null,"Jalisco",14,"La Huerta","043"]
[null,null,null,null,null,null,null,null,null,"Jalisco",14,"Ixtlahuacán de los Membrillos","044"]
[null,null,null,null,null,null,null,null,null,"Jalisco",14,"Ixtlahuacán del Río","045"]
[null,null,null,null,null,null,null,null,null,"Jalisco",14,"Jalostotitlán","046"]
[null,null,null,null,null,null,null,null,null,"Jalisco",14,"Jamay","047"]
[null,null,null,null,null,null,null,null,null,"Jalisco",14,"Jesús María","048"]
[null,null,null,null,null,null,null,null,null,"Jalisco",14,"Jilotlán de los Dolores","049"]
[null,null,null,null,null,null,null,null,null,"Jalisco",14,"Jocotepec","050"]
[null,null,null,null,null,null,null,null,null,"Jalisco",14,"Juanacatlán","051"]
[null,null,null,null,null,null,null,null,null,"Jalisco",14,"Juchitlán","052"]
[null,null,null,null,null,null,null,null,null,"Jalisco",14,"Lagos de Moreno","053"]
[null,null,null,null,null,null,null,null,null,"Jalisco",14,"El Limón","054"]
[null,null,null,null,null,null,null,null,null,"Jalisco",14,"Magdalena","055"]
[null,null,null,null,null,null,null,null,null,"Jalisco",14,"Santa María del Oro","056"]
[null,null,null,null,null,null,null,null,null,"Jalisco",14,"La Manzanilla de la Paz","057"]
[null,null,null,null,null,null,null,null,null,"Jalisco",14,"Mascota","058"]
[null,null,null,null,null,null,null,null,null,"Jalisco",14,"Mazamitla","059"]
[null,null,null,null,null,null,null,null,null,"Jalisco",14,"Mexticacán","060"]
[null,null,null,null,null,null,null,null,null,"Jalisco",14,"Mezquitic","061"]
[null,null,null,null,null,null,null,null,null,"Jalisco",14,"Mixtlán","062"]
[null,null,null,null,null,null,null,null,null,"Jalisco",14,"Ocotlán","063"]
[null,null,null,null,null,null,null,null,null,"Jalisco",14,"Ojuelos de Jalisco","064"]
[null,null,null,null,null,null,null,null,null,"Jalisco",14,"Pihuamo","065"]
[null,null,null,null,null,null,null,null,null,"Jalisco",14,"Poncitlán","066"]
[null,null,null,null,null,null,null,null,null,"Jalisco",14,"Puerto Vallarta","067"]
[null,null,null,null,null,null,null,null,null,"Jalisco",14,"Villa Purificación","068"]
[null,null,null,null,null,null,null,null,null,"Jalisco",14,"Quitupan","069"]
[null,null,null,null,null,null,null,null,null,"Jalisco",14,"El Salto","070"]
[null,null,null,null,null,null,null,null,null,"Jalisco",14,"San Cristóbal de la Barranca","071"]
[null,null,null,null,null,null,null,null,null,"Jalisco",14,"San Diego de Alejandría","072"]
[null,null,null,null,null,null,null,null,null,"Jalisco",14,"San Juan de los Lagos","073"]
[null,null,null,null,null,null,null,null,null,"Jalisco",14,"San Julián","074"]
[null,null,null,null,null,null,null,null,null,"Jalisco",14,"San Marcos","075"]
[null,null,null,null,null,null,null,null,null,"Jalisco",14,"San Martín de Bolaños","076"]
[null,null,null,null,null,null,null,null,null,"Jalisco",14,"San Martín Hidalgo","077"]
[null,null,null,null,null,null,null,null,null,"Jalisco",14,"San Miguel el Alto","078"]
[null,null,null,null,null,null,null,null,null,"Jalisco",14,"Gómez Farías","079"]
[null,null,null,null,null,null,null,null,null,"Jalisco",14,"San Sebastián del Oeste","080"]
[null,null,null,null,null,null,null,null,null,"Jalisco",14,"Santa María de los Ángeles","081"]
[null,null,null,null,null,null,null,null,null,"Jalisco",14,"Sayula","082"]
[null,null,null,null,null,null,null,null,null,"Jalisco",14,"Tala","083"]
[null,null,null,null,null,null,null,null,null,"Jalisco",14,"Talpa de Allende","084"]
[null,null,null,null,null,null,null,null,null,"Jalisco",14,"Tamazula de Gordiano","085"]
[null,null,null,null,null,null,null,null,null,"Jalisco",14,"Tapalpa","086"]
[null,null,null,null,null,null,null,null,null,"Jalisco",14,"Tecalitlán","087"]
[null,null,null,null,null,null,null,null,null,"Jalisco",14,"Tecolotlán","088"]
[null,null,null,null,null,null,null,null,null,"Jalisco",14,"Techaluta de Montenegro","089"]
[null,null,null,null,null,null,null,null,null,"Jalisco",14,"Tenamaxtlán","090"]
[null,null,null,null,null,null,null,null,null,"Jalisco",14,"Teocaltiche","091"]
[null,null,null,null,null,null,null,null,null,"Jalisco",14,"Teocuitatlán de Corona","092"]
[null,null,null,null,null,null,null,null,null,"Jalisco",14,"Tepatitlán de Morelos","093"]
[null,null,null,null,null,null,null,null,null,"Jalisco",14,"Tequila","094"]
[null,null,null,null,null,null,null,null,null,"Jalisco",14,"Teuchitlán","095"]
[null,null,null,null,null,null,null,null,null,"Jalisco",14,"Tizapán el Alto","096"]
[null,null,null,null,null,null,null,null,null,"Jalisco",14,"Tlajomulco de Zúñiga","097"]
[null,null,null,null,null,null,null,null,null,"Jalisco",14,"San Pedro Tlaquepaque","098"]
[null,null,null,null,null,null,null,null,null,"Jalisco",14,"Tolimán","099"]
[null,null,null,null,null,null,null,null,null,"Jalisco",14,"Tomatlán",100]
[null,null,null,null,null,null,null,null,null,"Jalisco",14,"Tonalá",101]
[null,null,null,null,null,null,null,null,null,"Jalisco",14,"Tonaya",102]
[null,null,null,null,null,null,null,null,null,"Jalisco",14,"Tonila",103]
[null,null,null,null,null,null,null,null,null,"Jalisco",14,"Totatiche",104]
[null,null,null,null,null,null,null,null,null,"Jalisco",14,"Tototlán",105]
[null,null,null,null,null,null,null,null,null,"Jalisco",14,"Tuxcacuesco",106]
[null,null,null,null,null,null,null,null,null,"Jalisco",14,"Tuxcueca",107]
[null,null,null,null,null,null,null,null,null,"Jalisco",14,"Tuxpan",108]
[null,null,null,null,null,null,null,null,null,"Jalisco",14,"Unión de San Antonio",109]
[null,null,null,null,null,null,null,null,null,"Jalisco",14,"Unión de Tula",110]
[null,null,null,null,null,null,null,null,null,"Jalisco",14,"Valle de Guadalupe",111]
[null,null,null,null,null,null,null,null,null,"Jalisco",14,"Valle de Juárez",112]
[null,null,null,null,null,null,null,null,null,"Jalisco",14,"San Gabriel",113]
[null,null,null,null,null,null,null,null,null,"Jalisco",14,"Villa Corona",114]
[null,null,null,null,null,null,null,null,null,"Jalisco",14,"Villa Guerrero",115]
[null,null,null,null,null,null,null,null,null,"Jalisco",14,"Villa Hidalgo",116]
[null,null,null,null,null,null,null,null,null,"Jalisco",14,"Cañadas de Obregón",117]
[null,null,null,null,null,null,null,null,null,"Jalisco",14,"Yahualica de González Gallo",118]
[null,null,null,null,null,null,null,null,null,"Jalisco",14,"Zacoalco de Torres",119]
[null,null,null,null,null,null,null,null,null,"Jalisco",14,"Zapopan",120]
[null,null,null,null,null,null,null,null,null,"Jalisco",14,"Zapotiltic",121]
[null,null,null,null,null,null,null,null,null,"Jalisco",14,"Zapotitlán de Vadillo",122]
[null,null,null,null,null,null,null,null,null,"Jalisco",14,"Zapotlán del Rey",123]
[null,null,null,null,null,null,null,null,null,"Jalisco",14,"Zapotlanejo",124]
[null,null,null,null,null,null,null,null,null,"Jalisco",14,"San Ignacio Cerro Gordo",125]
[null,null,null,null,null,null,null,null,null,"Jalisco",14,"Sin municipio identificado","999"]
[null,null,null,null,null,null,null,null,null,"México",15,"Acambay de Ruíz Castañeda","001"]
[null,null,null,null,null,null,null,null,null,"México",15,"Acolman","002"]
[null,null,null,null,null,null,null,null,null,"México",15,"Aculco","003"]
[null,null,null,null,null,null,null,null,null,"México",15,"Almoloya de Alquisiras","004"]
[null,null,null,null,null,null,null,null,null,"México",15,"Almoloya de Juárez","005"]
[null,null,null,null,null,null,null,null,null,"México",15,"Almoloya del Río","006"]
[null,null,null,null,null,null,null,null,null,"México",15,"Amanalco","007"]
[null,null,null,null,null,null,null,null,null,"México",15,"Amatepec","008"]
[null,null,null,null,null,null,null,null,null,"México",15,"Amecameca","009"]
[null,null,null,null,null,null,null,null,null,"México",15,"Apaxco","010"]
[null,null,null,null,null,null,null,null,null,"México",15,"Atenco","011"]
[null,null,null,null,null,null,null,null,null,"México",15,"Atizapán","012"]
[null,null,null,null,null,null,null,null,null,"México",15,"Atizapán de Zaragoza","013"]
[null,null,null,null,null,null,null,null,null,"México",15,"Atlacomulco","014"]
[null,null,null,null,null,null,null,null,null,"México",15,"Atlautla","015"]
[null,null,null,null,null,null,null,null,null,"México",15,"Axapusco","016"]
[null,null,null,null,null,null,null,null,null,"México",15,"Ayapango","017"]
[null,null,null,null,null,null,null,null,null,"México",15,"Calimaya","018"]
[null,null,null,null,null,null,null,null,null,"México",15,"Capulhuac","019"]
[null,null,null,null,null,null,null,null,null,"México",15,"Coacalco de Berriozábal","020"]
[null,null,null,null,null,null,null,null,null,"México",15,"Coatepec Harinas","021"]
[null,null,null,null,null,null,null,null,null,"México",15,"Cocotitlán","022"]
[null,null,null,null,null,null,null,null,null,"México",15,"Coyotepec","023"]
[null,null,null,null,null,null,null,null,null,"México",15,"Cuautitlán","024"]
[null,null,null,null,null,null,null,null,null,"México",15,"Chalco","025"]
[null,null,null,null,null,null,null,null,null,"México",15,"Chapa de Mota","026"]
[null,null,null,null,null,null,null,null,null,"México",15,"Chapultepec","027"]
[null,null,null,null,null,null,null,null,null,"México",15,"Chiautla","028"]
[null,null,null,null,null,null,null,null,null,"México",15,"Chicoloapan","029"]
[null,null,null,null,null,null,null,null,null,"México",15,"Chiconcuac","030"]
[null,null,null,null,null,null,null,null,null,"México",15,"Chimalhuacán","031"]
[null,null,null,null,null,null,null,null,null,"México",15,"Donato Guerra","032"]
[null,null,null,null,null,null,null,null,null,"México",15,"Ecatepec de Morelos","033"]
[null,null,null,null,null,null,null,null,null,"México",15,"Ecatzingo","034"]
[null,null,null,null,null,null,null,null,null,"México",15,"Huehuetoca","035"]
[null,null,null,null,null,null,null,null,null,"México",15,"Hueypoxtla","036"]
[null,null,null,null,null,null,null,null,null,"México",15,"Huixquilucan","037"]
[null,null,null,null,null,null,null,null,null,"México",15,"Isidro Fabela","038"]
[null,null,null,null,null,null,null,null,null,"México",15,"Ixtapaluca","039"]
[null,null,null,null,null,null,null,null,null,"México",15,"Ixtapan de la Sal","040"]
[null,null,null,null,null,null,null,null,null,"México",15,"Ixtapan del Oro","041"]
[null,null,null,null,null,null,null,null,null,"México",15,"Ixtlahuaca","042"]
[null,null,null,null,null,null,null,null,null,"México",15,"Xalatlaco","043"]
[null,null,null,null,null,null,null,null,null,"México",15,"Jaltenco","044"]
[null,null,null,null,null,null,null,null,null,"México",15,"Jilotepec","045"]
[null,null,null,null,null,null,null,null,null,"México",15,"Jilotzingo","046"]
[null,null,null,null,null,null,null,null,null,"México",15,"Jiquipilco","047"]
[null,null,null,null,null,null,null,null,null,"México",15,"Jocotitlán","048"]
[null,null,null,null,null,null,null,null,null,"México",15,"Joquicingo","049"]
[null,null,null,null,null,null,null,null,null,"México",15,"Juchitepec","050"]
[null,null,null,null,null,null,null,null,null,"México",15,"Lerma","051"]
[null,null,null,null,null,null,null,null,null,"México",15,"Malinalco","052"]
[null,null,null,null,null,null,null,null,null,"México",15,"Melchor Ocampo","053"]
[null,null,null,null,null,null,null,null,null,"México",15,"Metepec","054"]
[null,null,null,null,null,null,null,null,null,"México",15,"Mexicaltzingo","055"]
[null,null,null,null,null,null,null,null,null,"México",15,"Morelos","056"]
[null,null,null,null,null,null,null,null,null,"México",15,"Naucalpan de Juárez","057"]
[null,null,null,null,null,null,null,null,null,"México",15,"Nezahualcóyotl","058"]
[null,null,null,null,null,null,null,null,null,"México",15,"Nextlalpan","059"]
[null,null,null,null,null,null,null,null,null,"México",15,"Nicolás Romero","060"]
[null,null,null,null,null,null,null,null,null,"México",15,"Nopaltepec","061"]
[null,null,null,null,null,null,null,null,null,"México",15,"Ocoyoacac","062"]
[null,null,null,null,null,null,null,null,null,"México",15,"Ocuilan","063"]
[null,null,null,null,null,null,null,null,null,"México",15,"El Oro","064"]
[null,null,null,null,null,null,null,null,null,"México",15,"Otumba","065"]
[null,null,null,null,null,null,null,null,null,"México",15,"Otzoloapan","066"]
[null,null,null,null,null,null,null,null,null,"México",15,"Otzolotepec","067"]
[null,null,null,null,null,null,null,null,null,"México",15,"Ozumba","068"]
[null,null,null,null,null,null,null,null,null,"México",15,"Papalotla","069"]
[null,null,null,null,null,null,null,null,null,"México",15,"La Paz","070"]
[null,null,null,null,null,null,null,null,null,"México",15,"Polotitlán","071"]
[null,null,null,null,null,null,null,null,null,"México",15,"Rayón","072"]
[null,null,null,null,null,null,null,null,null,"México",15,"San Antonio la Isla","073"]
[null,null,null,null,null,null,null,null,null,"México",15,"San Felipe del Progreso","074"]
[null,null,null,null,null,null,null,null,null,"México",15,"San Martín de las Pirámides","075"]
[null,null,null,null,null,null,null,null,null,"México",15,"San Mateo Atenco","076"]
[null,null,null,null,null,null,null,null,null,"México",15,"San Simón de Guerrero","077"]
[null,null,null,null,null,null,null,null,null,"México",15,"Santo Tomás","078"]
[null,null,null,null,null,null,null,null,null,"México",15,"Soyaniquilpan de Juárez","079"]
[null,null,null,null,null,null,null,null,null,"México",15,"Sultepec","080"]
[null,null,null,null,null,null,null,null,null,"México",15,"Tecámac","081"]
[null,null,null,null,null,null,null,null,null,"México",15,"Tejupilco","082"]
[null,null,null,null,null,null,null,null,null,"México",15,"Temamatla","083"]
[null,null,null,null,null,null,null,null,null,"México",15,"Temascalapa","084"]
[null,null,null,null,null,null,null,null,null,"México",15,"Temascalcingo","085"]
[null,null,null,null,null,null,null,null,null,"México",15,"Temascaltepec","086"]
[null,null,null,null,null,null,null,null,null,"México",15,"Temoaya","087"]
[null,null,null,null,null,null,null,null,null,"México",15,"Tenancingo","088"]
[null,null,null,null,null,null,null,null,null,"México",15,"Tenango del Aire","089"]
[null,null,null,null,null,null,null,null,null,"México",15,"Tenango del Valle","090"]
[null,null,null,null,null,null,null,null,null,"México",15,"Teoloyucan","091"]
[null,null,null,null,null,null,null,null,null,"México",15,"Teotihuacán","092"]
[null,null,null,null,null,null,null,null,null,"México",15,"Tepetlaoxtoc","093"]
[null,null,null,null,null,null,null,null,null,"México",15,"Tepetlixpa","094"]
[null,null,null,null,null,null,null,null,null,"México",15,"Tepotzotlán","095"]
[null,null,null,null,null,null,null,null,null,"México",15,"Tequixquiac","096"]
[null,null,null,null,null,null,null,null,null,"México",15,"Texcaltitlán","097"]
[null,null,null,null,null,null,null,null,null,"México",15,"Texcalyacac","098"]
[null,null,null,null,null,null,null,null,null,"México",15,"Texcoco","099"]
[null,null,null,null,null,null,null,null,null,"México",15,"Tezoyuca",100]
[null,null,null,null,null,null,null,null,null,"México",15,"Tianguistenco",101]
[null,null,null,null,null,null,null,null,null,"México",15,"Timilpan",102]
[null,null,null,null,null,null,null,null,null,"México",15,"Tlalmanalco",103]
[null,null,null,null,null,null,null,null,null,"México",15,"Tlalnepantla de Baz",104]
[null,null,null,null,null,null,null,null,null,"México",15,"Tlatlaya",105]
[null,null,null,null,null,null,null,null,null,"México",15,"Toluca",106]
[null,null,null,null,null,null,null,null,null,"México",15,"Tonatico",107]
[null,null,null,null,null,null,null,null,null,"México",15,"Tultepec",108]
[null,null,null,null,null,null,null,null,null,"México",15,"Tultitlán",109]
[null,null,null,null,null,null,null,null,null,"México",15,"Valle de Bravo",110]
[null,null,null,null,null,null,null,null,null,"México",15,"Villa de Allende",111]
[null,null,null,null,null,null,null,null,null,"México",15,"Villa del Carbón",112]
[null,null,null,null,null,null,null,null,null,"México",15,"Villa Guerrero",113]
[null,null,null,null,null,null,null,null,null,"México",15,"Villa Victoria",114]
[null,null,null,null,null,null,null,null,null,"México",15,"Xonacatlán",115]
[null,null,null,null,null,null,null,null,null,"México",15,"Zacazonapan",116]
[null,null,null,null,null,null,null,null,null,"México",15,"Zacualpan",117]
[null,null,null,null,null,null,null,null,null,"México",15,"Zinacantepec",118]
[null,null,null,null,null,null,null,null,null,"México",15,"Zumpahuacán",119]
[null,null,null,null,null,null,null,null,null,"México",15,"Zumpango",120]
[null,null,null,null,null,null,null,null,null,"México",15,"Cuautitlán Izcalli",121]
[null,null,null,null,null,null,null,null,null,"México",15,"Valle de Chalco Solidaridad",122]
[null,null,null,null,null,null,null,null,null,"México",15,"Luvianos",123]
[null,null,null,null,null,null,null,null,null,"México",15,"San José del Rincón",124]
[null,null,null,null,null,null,null,null,null,"México",15,"Tonanitla",125]
[null,null,null,null,null,null,null,null,null,"México",15,"Sin municipio identificado","999"]
[null,null,null,null,null,null,null,null,null,"Michoacán de Ocampo",16,"Acuitzio","001"]
[null,null,null,null,null,null,null,null,null,"Michoacán de Ocampo",16,"Aguililla","002"]
[null,null,null,null,null,null,null,null,null,"Michoacán de Ocampo",16,"Álvaro Obregón","003"]
[null,null,null,null,null,null,null,null,null,"Michoacán de Ocampo",16,"Angamacutiro","004"]
[null,null,null,null,null,null,null,null,null,"Michoacán de Ocampo",16,"Angangueo","005"]
[null,null,null,null,null,null,null,null,null,"Michoacán de Ocampo",16,"Apatzingán","006"]
[null,null,null,null,null,null,null,null,null,"Michoacán de Ocampo",16,"Aporo","007"]
[null,null,null,null,null,null,null,null,null,"Michoacán de Ocampo",16,"Aquila","008"]
[null,null,null,null,null,null,null,null,null,"Michoacán de Ocampo",16,"Ario","009"]
[null,null,null,null,null,null,null,null,null,"Michoacán de Ocampo",16,"Arteaga","010"]
[null,null,null,null,null,null,null,null,null,"Michoacán de Ocampo",16,"Briseñas","011"]
[null,null,null,null,null,null,null,null,null,"Michoacán de Ocampo",16,"Buenavista","012"]
[null,null,null,null,null,null,null,null,null,"Michoacán de Ocampo",16,"Carácuaro","013"]
[null,null,null,null,null,null,null,null,null,"Michoacán de Ocampo",16,"Coahuayana","014"]
[null,null,null,null,null,null,null,null,null,"Michoacán de Ocampo",16,"Coalcomán de Vázquez Pallares","015"]
[null,null,null,null,null,null,null,null,null,"Michoacán de Ocampo",16,"Coeneo","016"]
[null,null,null,null,null,null,null,null,null,"Michoacán de Ocampo",16,"Contepec","017"]
[null,null,null,null,null,null,null,null,null,"Michoacán de Ocampo",16,"Copándaro","018"]
[null,null,null,null,null,null,null,null,null,"Michoacán de Ocampo",16,"Cotija","019"]
[null,null,null,null,null,null,null,null,null,"Michoacán de Ocampo",16,"Cuitzeo","020"]
[null,null,null,null,null,null,null,null,null,"Michoacán de Ocampo",16,"Charapan","021"]
[null,null,null,null,null,null,null,null,null,"Michoacán de Ocampo",16,"Charo","022"]
[null,null,null,null,null,null,null,null,null,"Michoacán de Ocampo",16,"Chavinda","023"]
[null,null,null,null,null,null,null,null,null,"Michoacán de Ocampo",16,"Cherán","024"]
[null,null,null,null,null,null,null,null,null,"Michoacán de Ocampo",16,"Chilchota","025"]
[null,null,null,null,null,null,null,null,null,"Michoacán de Ocampo",16,"Chinicuila","026"]
[null,null,null,null,null,null,null,null,null,"Michoacán de Ocampo",16,"Chucándiro","027"]
[null,null,null,null,null,null,null,null,null,"Michoacán de Ocampo",16,"Churintzio","028"]
[null,null,null,null,null,null,null,null,null,"Michoacán de Ocampo",16,"Churumuco","029"]
[null,null,null,null,null,null,null,null,null,"Michoacán de Ocampo",16,"Ecuandureo","030"]
[null,null,null,null,null,null,null,null,null,"Michoacán de Ocampo",16,"Epitacio Huerta","031"]
[null,null,null,null,null,null,null,null,null,"Michoacán de Ocampo",16,"Erongarícuaro","032"]
[null,null,null,null,null,null,null,null,null,"Michoacán de Ocampo",16,"Gabriel Zamora","033"]
[null,null,null,null,null,null,null,null,null,"Michoacán de Ocampo",16,"Hidalgo","034"]
[null,null,null,null,null,null,null,null,null,"Michoacán de Ocampo",16,"La Huacana","035"]
[null,null,null,null,null,null,null,null,null,"Michoacán de Ocampo",16,"Huandacareo","036"]
[null,null,null,null,null,null,null,null,null,"Michoacán de Ocampo",16,"Huaniqueo","037"]
[null,null,null,null,null,null,null,null,null,"Michoacán de Ocampo",16,"Huetamo","038"]
[null,null,null,null,null,null,null,null,null,"Michoacán de Ocampo",16,"Huiramba","039"]
[null,null,null,null,null,null,null,null,null,"Michoacán de Ocampo",16,"Indaparapeo","040"]
[null,null,null,null,null,null,null,null,null,"Michoacán de Ocampo",16,"Irimbo","041"]
[null,null,null,null,null,null,null,null,null,"Michoacán de Ocampo",16,"Ixtlán","042"]
[null,null,null,null,null,null,null,null,null,"Michoacán de Ocampo",16,"Jacona","043"]
[null,null,null,null,null,null,null,null,null,"Michoacán de Ocampo",16,"Jiménez","044"]
[null,null,null,null,null,null,null,null,null,"Michoacán de Ocampo",16,"Jiquilpan","045"]
[null,null,null,null,null,null,null,null,null,"Michoacán de Ocampo",16,"Juárez","046"]
[null,null,null,null,null,null,null,null,null,"Michoacán de Ocampo",16,"Jungapeo","047"]
[null,null,null,null,null,null,null,null,null,"Michoacán de Ocampo",16,"Lagunillas","048"]
[null,null,null,null,null,null,null,null,null,"Michoacán de Ocampo",16,"Madero","049"]
[null,null,null,null,null,null,null,null,null,"Michoacán de Ocampo",16,"Maravatío","050"]
[null,null,null,null,null,null,null,null,null,"Michoacán de Ocampo",16,"Marcos Castellanos","051"]
[null,null,null,null,null,null,null,null,null,"Michoacán de Ocampo",16,"Lázaro Cárdenas","052"]
[null,null,null,null,null,null,null,null,null,"Michoacán de Ocampo",16,"Morelia","053"]
[null,null,null,null,null,null,null,null,null,"Michoacán de Ocampo",16,"Morelos","054"]
[null,null,null,null,null,null,null,null,null,"Michoacán de Ocampo",16,"Múgica","055"]
[null,null,null,null,null,null,null,null,null,"Michoacán de Ocampo",16,"Nahuatzen","056"]
[null,null,null,null,null,null,null,null,null,"Michoacán de Ocampo",16,"Nocupétaro","057"]
[null,null,null,null,null,null,null,null,null,"Michoacán de Ocampo",16,"Nuevo Parangaricutiro","058"]
[null,null,null,null,null,null,null,null,null,"Michoacán de Ocampo",16,"Nuevo Urecho","059"]
[null,null,null,null,null,null,null,null,null,"Michoacán de Ocampo",16,"Numarán","060"]
[null,null,null,null,null,null,null,null,null,"Michoacán de Ocampo",16,"Ocampo","061"]
[null,null,null,null,null,null,null,null,null,"Michoacán de Ocampo",16,"Pajacuarán","062"]
[null,null,null,null,null,null,null,null,null,"Michoacán de Ocampo",16,"Panindícuaro","063"]
[null,null,null,null,null,null,null,null,null,"Michoacán de Ocampo",16,"Parácuaro","064"]
[null,null,null,null,null,null,null,null,null,"Michoacán de Ocampo",16,"Paracho","065"]
[null,null,null,null,null,null,null,null,null,"Michoacán de Ocampo",16,"Pátzcuaro","066"]
[null,null,null,null,null,null,null,null,null,"Michoacán de Ocampo",16,"Penjamillo","067"]
[null,null,null,null,null,null,null,null,null,"Michoacán de Ocampo",16,"Peribán","068"]
[null,null,null,null,null,null,null,null,null,"Michoacán de Ocampo",16,"La Piedad","069"]
[null,null,null,null,null,null,null,null,null,"Michoacán de Ocampo",16,"Purépero","070"]
[null,null,null,null,null,null,null,null,null,"Michoacán de Ocampo",16,"Puruándiro","071"]
[null,null,null,null,null,null,null,null,null,"Michoacán de Ocampo",16,"Queréndaro","072"]
[null,null,null,null,null,null,null,null,null,"Michoacán de Ocampo",16,"Quiroga","073"]
[null,null,null,null,null,null,null,null,null,"Michoacán de Ocampo",16,"Cojumatlán de Régules","074"]
[null,null,null,null,null,null,null,null,null,"Michoacán de Ocampo",16,"Los Reyes","075"]
[null,null,null,null,null,null,null,null,null,"Michoacán de Ocampo",16,"Sahuayo","076"]
[null,null,null,null,null,null,null,null,null,"Michoacán de Ocampo",16,"San Lucas","077"]
[null,null,null,null,null,null,null,null,null,"Michoacán de Ocampo",16,"Santa Ana Maya","078"]
[null,null,null,null,null,null,null,null,null,"Michoacán de Ocampo",16,"Salvador Escalante","079"]
[null,null,null,null,null,null,null,null,null,"Michoacán de Ocampo",16,"Senguio","080"]
[null,null,null,null,null,null,null,null,null,"Michoacán de Ocampo",16,"Susupuato","081"]
[null,null,null,null,null,null,null,null,null,"Michoacán de Ocampo",16,"Tacámbaro","082"]
[null,null,null,null,null,null,null,null,null,"Michoacán de Ocampo",16,"Tancítaro","083"]
[null,null,null,null,null,null,null,null,null,"Michoacán de Ocampo",16,"Tangamandapio","084"]
[null,null,null,null,null,null,null,null,null,"Michoacán de Ocampo",16,"Tangancícuaro","085"]
[null,null,null,null,null,null,null,null,null,"Michoacán de Ocampo",16,"Tanhuato","086"]
[null,null,null,null,null,null,null,null,null,"Michoacán de Ocampo",16,"Taretan","087"]
[null,null,null,null,null,null,null,null,null,"Michoacán de Ocampo",16,"Tarímbaro","088"]
[null,null,null,null,null,null,null,null,null,"Michoacán de Ocampo",16,"Tepalcatepec","089"]
[null,null,null,null,null,null,null,null,null,"Michoacán de Ocampo",16,"Tingambato","090"]
[null,null,null,null,null,null,null,null,null,"Michoacán de Ocampo",16,"Tingüindín","091"]
[null,null,null,null,null,null,null,null,null,"Michoacán de Ocampo",16,"Tiquicheo de Nicolás Romero","092"]
[null,null,null,null,null,null,null,null,null,"Michoacán de Ocampo",16,"Tlalpujahua","093"]
[null,null,null,null,null,null,null,null,null,"Michoacán de Ocampo",16,"Tlazazalca","094"]
[null,null,null,null,null,null,null,null,null,"Michoacán de Ocampo",16,"Tocumbo","095"]
[null,null,null,null,null,null,null,null,null,"Michoacán de Ocampo",16,"Tumbiscatío","096"]
[null,null,null,null,null,null,null,null,null,"Michoacán de Ocampo",16,"Turicato","097"]
[null,null,null,null,null,null,null,null,null,"Michoacán de Ocampo",16,"Tuxpan","098"]
[null,null,null,null,null,null,null,null,null,"Michoacán de Ocampo",16,"Tuzantla","099"]
[null,null,null,null,null,null,null,null,null,"Michoacán de Ocampo",16,"Tzintzuntzan",100]
[null,null,null,null,null,null,null,null,null,"Michoacán de Ocampo",16,"Tzitzio",101]
[null,null,null,null,null,null,null,null,null,"Michoacán de Ocampo",16,"Uruapan",102]
[null,null,null,null,null,null,null,null,null,"Michoacán de Ocampo",16,"Venustiano Carranza",103]
[null,null,null,null,null,null,null,null,null,"Michoacán de Ocampo",16,"Villamar",104]
[null,null,null,null,null,null,null,null,null,"Michoacán de Ocampo",16,"Vista Hermosa",105]
[null,null,null,null,null,null,null,null,null,"Michoacán de Ocampo",16,"Yurécuaro",106]
[null,null,null,null,null,null,null,null,null,"Michoacán de Ocampo",16,"Zacapu",107]
[null,null,null,null,null,null,null,null,null,"Michoacán de Ocampo",16,"Zamora",108]
[null,null,null,null,null,null,null,null,null,"Michoacán de Ocampo",16,"Zináparo",109]
[null,null,null,null,null,null,null,null,null,"Michoacán de Ocampo",16,"Zinapécuaro",110]
[null,null,null,null,null,null,null,null,null,"Michoacán de Ocampo",16,"Ziracuaretiro",111]
[null,null,null,null,null,null,null,null,null,"Michoacán de Ocampo",16,"Zitácuaro",112]
[null,null,null,null,null,null,null,null,null,"Michoacán de Ocampo",16,"José Sixto Verduzco",113]
[null,null,null,null,null,null,null,null,null,"Michoacán de Ocampo",16,"Sin municipio identificado","999"]
[null,null,null,null,null,null,null,null,null,"Morelos",17,"Amacuzac","001"]
[null,null,null,null,null,null,null,null,null,"Morelos",17,"Atlatlahucan","002"]
[null,null,null,null,null,null,null,null,null,"Morelos",17,"Axochiapan","003"]
[null,null,null,null,null,null,null,null,null,"Morelos",17,"Ayala","004"]
[null,null,null,null,null,null,null,null,null,"Morelos",17,"Coatlán del Río","005"]
[null,null,null,null,null,null,null,null,null,"Morelos",17,"Cuautla","006"]
[null,null,null,null,null,null,null,null,null,"Morelos",17,"Cuernavaca","007"]
[null,null,null,null,null,null,null,null,null,"Morelos",17,"Emiliano Zapata","008"]
[null,null,null,null,null,null,null,null,null,"Morelos",17,"Huitzilac","009"]
[null,null,null,null,null,null,null,null,null,"Morelos",17,"Jantetelco","010"]
[null,null,null,null,null,null,null,null,null,"Morelos",17,"Jiutepec","011"]
[null,null,null,null,null,null,null,null,null,"Morelos",17,"Jojutla","012"]
[null,null,null,null,null,null,null,null,null,"Morelos",17,"Jonacatepec de Leandro Valle","013"]
[null,null,null,null,null,null,null,null,null,"Morelos",17,"Mazatepec","014"]
[null,null,null,null,null,null,null,null,null,"Morelos",17,"Miacatlán","015"]
[null,null,null,null,null,null,null,null,null,"Morelos",17,"Ocuituco","016"]
[null,null,null,null,null,null,null,null,null,"Morelos",17,"Puente de Ixtla","017"]
[null,null,null,null,null,null,null,null,null,"Morelos",17,"Temixco","018"]
[null,null,null,null,null,null,null,null,null,"Morelos",17,"Tepalcingo","019"]
[null,null,null,null,null,null,null,null,null,"Morelos",17,"Tepoztlán","020"]
[null,null,null,null,null,null,null,null,null,"Morelos",17,"Tetecala","021"]
[null,null,null,null,null,null,null,null,null,"Morelos",17,"Tetela del Volcán","022"]
[null,null,null,null,null,null,null,null,null,"Morelos",17,"Tlalnepantla","023"]
[null,null,null,null,null,null,null,null,null,"Morelos",17,"Tlaltizapán de Zapata","024"]
[null,null,null,null,null,null,null,null,null,"Morelos",17,"Tlaquiltenango","025"]
[null,null,null,null,null,null,null,null,null,"Morelos",17,"Tlayacapan","026"]
[null,null,null,null,null,null,null,null,null,"Morelos",17,"Totolapan","027"]
[null,null,null,null,null,null,null,null,null,"Morelos",17,"Xochitepec","028"]
[null,null,null,null,null,null,null,null,null,"Morelos",17,"Yautepec","029"]
[null,null,null,null,null,null,null,null,null,"Morelos",17,"Yecapixtla","030"]
[null,null,null,null,null,null,null,null,null,"Morelos",17,"Zacatepec","031"]
[null,null,null,null,null,null,null,null,null,"Morelos",17,"Zacualpan de Amilpas","032"]
[null,null,null,null,null,null,null,null,null,"Morelos",17,"Temoac","033"]
[null,null,null,null,null,null,null,null,null,"Morelos",17,"Coatetelco","034"]
[null,null,null,null,null,null,null,null,null,"Morelos",17,"Xoxocotla","035"]
[null,null,null,null,null,null,null,null,null,"Morelos",17,"Hueyapan","036"]
[null,null,null,null,null,null,null,null,null,"Morelos",17,"Sin municipio identificado","999"]
[null,null,null,null,null,null,null,null,null,"Nayarit",18,"Acaponeta","001"]
[null,null,null,null,null,null,null,null,null,"Nayarit",18,"Ahuacatlán","002"]
[null,null,null,null,null,null,null,null,null,"Nayarit",18,"Amatlán de Cañas","003"]
[null,null,null,null,null,null,null,null,null,"Nayarit",18,"Compostela","004"]
[null,null,null,null,null,null,null,null,null,"Nayarit",18,"Huajicori","005"]
[null,null,null,null,null,null,null,null,null,"Nayarit",18,"Ixtlán del Río","006"]
[null,null,null,null,null,null,null,null,null,"Nayarit",18,"Jala","007"]
[null,null,null,null,null,null,null,null,null,"Nayarit",18,"Xalisco","008"]
[null,null,null,null,null,null,null,null,null,"Nayarit",18,"Del Nayar","009"]
[null,null,null,null,null,null,null,null,null,"Nayarit",18,"Rosamorada","010"]
[null,null,null,null,null,null,null,null,null,"Nayarit",18,"Ruíz","011"]
[null,null,null,null,null,null,null,null,null,"Nayarit",18,"San Blas","012"]
[null,null,null,null,null,null,null,null,null,"Nayarit",18,"San Pedro Lagunillas","013"]
[null,null,null,null,null,null,null,null,null,"Nayarit",18,"Santa María del Oro","014"]
[null,null,null,null,null,null,null,null,null,"Nayarit",18,"Santiago Ixcuintla","015"]
[null,null,null,null,null,null,null,null,null,"Nayarit",18,"Tecuala","016"]
[null,null,null,null,null,null,null,null,null,"Nayarit",18,"Tepic","017"]
[null,null,null,null,null,null,null,null,null,"Nayarit",18,"Tuxpan","018"]
[null,null,null,null,null,null,null,null,null,"Nayarit",18,"La Yesca","019"]
[null,null,null,null,null,null,null,null,null,"Nayarit",18,"Bahía de Banderas","020"]
[null,null,null,null,null,null,null,null,null,"Nayarit",18,"Sin municipio identificado","999"]
[null,null,null,null,null,null,null,null,null,"Nuevo León",19,"Abasolo","001"]
[null,null,null,null,null,null,null,null,null,"Nuevo León",19,"Agualeguas","002"]
[null,null,null,null,null,null,null,null,null,"Nuevo León",19,"Los Aldamas","003"]
[null,null,null,null,null,null,null,null,null,"Nuevo León",19,"Allende","004"]
[null,null,null,null,null,null,null,null,null,"Nuevo León",19,"Anáhuac","005"]
[null,null,null,null,null,null,null,null,null,"Nuevo León",19,"Apodaca","006"]
[null,null,null,null,null,null,null,null,null,"Nuevo León",19,"Aramberri","007"]
[null,null,null,null,null,null,null,null,null,"Nuevo León",19,"Bustamante","008"]
[null,null,null,null,null,null,null,null,null,"Nuevo León",19,"Cadereyta Jiménez","009"]
[null,null,null,null,null,null,null,null,null,"Nuevo León",19,"El Carmen","010"]
[null,null,null,null,null,null,null,null,null,"Nuevo León",19,"Cerralvo","011"]
[null,null,null,null,null,null,null,null,null,"Nuevo León",19,"Ciénega de Flores","012"]
[null,null,null,null,null,null,null,null,null,"Nuevo León",19,"China","013"]
[null,null,null,null,null,null,null,null,null,"Nuevo León",19,"Doctor Arroyo","014"]
[null,null,null,null,null,null,null,null,null,"Nuevo León",19,"Doctor Coss","015"]
[null,null,null,null,null,null,null,null,null,"Nuevo León",19,"Doctor González","016"]
[null,null,null,null,null,null,null,null,null,"Nuevo León",19,"Galeana","017"]
[null,null,null,null,null,null,null,null,null,"Nuevo León",19,"García","018"]
[null,null,null,null,null,null,null,null,null,"Nuevo León",19,"San Pedro Garza García","019"]
[null,null,null,null,null,null,null,null,null,"Nuevo León",19,"General Bravo","020"]
[null,null,null,null,null,null,null,null,null,"Nuevo León",19,"General Escobedo","021"]
[null,null,null,null,null,null,null,null,null,"Nuevo León",19,"General Terán","022"]
[null,null,null,null,null,null,null,null,null,"Nuevo León",19,"General Treviño","023"]
[null,null,null,null,null,null,null,null,null,"Nuevo León",19,"General Zaragoza","024"]
[null,null,null,null,null,null,null,null,null,"Nuevo León",19,"General Zuazua","025"]
[null,null,null,null,null,null,null,null,null,"Nuevo León",19,"Guadalupe","026"]
[null,null,null,null,null,null,null,null,null,"Nuevo León",19,"Los Herreras","027"]
[null,null,null,null,null,null,null,null,null,"Nuevo León",19,"Higueras","028"]
[null,null,null,null,null,null,null,null,null,"Nuevo León",19,"Hualahuises","029"]
[null,null,null,null,null,null,null,null,null,"Nuevo León",19,"Iturbide","030"]
[null,null,null,null,null,null,null,null,null,"Nuevo León",19,"Juárez","031"]
[null,null,null,null,null,null,null,null,null,"Nuevo León",19,"Lampazos de Naranjo","032"]
[null,null,null,null,null,null,null,null,null,"Nuevo León",19,"Linares","033"]
[null,null,null,null,null,null,null,null,null,"Nuevo León",19,"Marín","034"]
[null,null,null,null,null,null,null,null,null,"Nuevo León",19,"Melchor Ocampo","035"]
[null,null,null,null,null,null,null,null,null,"Nuevo León",19,"Mier y Noriega","036"]
[null,null,null,null,null,null,null,null,null,"Nuevo León",19,"Mina","037"]
[null,null,null,null,null,null,null,null,null,"Nuevo León",19,"Montemorelos","038"]
[null,null,null,null,null,null,null,null,null,"Nuevo León",19,"Monterrey","039"]
[null,null,null,null,null,null,null,null,null,"Nuevo León",19,"Parás","040"]
[null,null,null,null,null,null,null,null,null,"Nuevo León",19,"Pesquería","041"]
[null,null,null,null,null,null,null,null,null,"Nuevo León",19,"Los Ramones","042"]
[null,null,null,null,null,null,null,null,null,"Nuevo León",19,"Rayones","043"]
[null,null,null,null,null,null,null,null,null,"Nuevo León",19,"Sabinas Hidalgo","044"]
[null,null,null,null,null,null,null,null,null,"Nuevo León",19,"Salinas Victoria","045"]
[null,null,null,null,null,null,null,null,null,"Nuevo León",19,"San Nicolás de los Garza","046"]
[null,null,null,null,null,null,null,null,null,"Nuevo León",19,"Hidalgo","047"]
[null,null,null,null,null,null,null,null,null,"Nuevo León",19,"Santa Catarina","048"]
[null,null,null,null,null,null,null,null,null,"Nuevo León",19,"Santiago","049"]
[null,null,null,null,null,null,null,null,null,"Nuevo León",19,"Vallecillo","050"]
[null,null,null,null,null,null,null,null,null,"Nuevo León",19,"Villaldama","051"]
[null,null,null,null,null,null,null,null,null,"Nuevo León",19,"Sin municipio identificado","999"]
[null,null,null,null,null,null,null,null,null,"Oaxaca",20,"Abejones","001"]
[null,null,null,null,null,null,null,null,null,"Oaxaca",20,"Acatlán de Pérez Figueroa","002"]
[null,null,null,null,null,null,null,null,null,"Oaxaca",20,"Asunción Cacalotepec","003"]
[null,null,null,null,null,null,null,null,null,"Oaxaca",20,"Asunción Cuyotepeji","004"]
[null,null,null,null,null,null,null,null,null,"Oaxaca",20,"Asunción Ixtaltepec","005"]
[null,null,null,null,null,null,null,null,null,"Oaxaca",20,"Asunción Nochixtlán","006"]
[null,null,null,null,null,null,null,null,null,"Oaxaca",20,"Asunción Ocotlán","007"]
[null,null,null,null,null,null,null,null,null,"Oaxaca",20,"Asunción Tlacolulita","008"]
[null,null,null,null,null,null,null,null,null,"Oaxaca",20,"Ayotzintepec","009"]
[null,null,null,null,null,null,null,null,null,"Oaxaca",20,"El Barrio de la Soledad","010"]
[null,null,null,null,null,null,null,null,null,"Oaxaca",20,"Calihualá","011"]
[null,null,null,null,null,null,null,null,null,"Oaxaca",20,"Candelaria Loxicha","012"]
[null,null,null,null,null,null,null,null,null,"Oaxaca",20,"Ciénega de Zimatlán","013"]
[null,null,null,null,null,null,null,null,null,"Oaxaca",20,"Ciudad Ixtepec","014"]
[null,null,null,null,null,null,null,null,null,"Oaxaca",20,"Coatecas Altas","015"]
[null,null,null,null,null,null,null,null,null,"Oaxaca",20,"Coicoyán de las Flores","016"]
[null,null,null,null,null,null,null,null,null,"Oaxaca",20,"La Compañía","017"]
[null,null,null,null,null,null,null,null,null,"Oaxaca",20,"Concepción Buenavista","018"]
[null,null,null,null,null,null,null,null,null,"Oaxaca",20,"Concepción Pápalo","019"]
[null,null,null,null,null,null,null,null,null,"Oaxaca",20,"Constancia del Rosario","020"]
[null,null,null,null,null,null,null,null,null,"Oaxaca",20,"Cosolapa","021"]
[null,null,null,null,null,null,null,null,null,"Oaxaca",20,"Cosoltepec","022"]
[null,null,null,null,null,null,null,null,null,"Oaxaca",20,"Cuilápam de Guerrero","023"]
[null,null,null,null,null,null,null,null,null,"Oaxaca",20,"Cuyamecalco Villa de Zaragoza","024"]
[null,null,null,null,null,null,null,null,null,"Oaxaca",20,"Chahuites","025"]
[null,null,null,null,null,null,null,null,null,"Oaxaca",20,"Chalcatongo de Hidalgo","026"]
[null,null,null,null,null,null,null,null,null,"Oaxaca",20,"Chiquihuitlán de Benito Juárez","027"]
[null,null,null,null,null,null,null,null,null,"Oaxaca",20,"Heroica Ciudad de Ejutla de Crespo","028"]
[null,null,null,null,null,null,null,null,null,"Oaxaca",20,"Eloxochitlán de Flores Magón","029"]
[null,null,null,null,null,null,null,null,null,"Oaxaca",20,"El Espinal","030"]
[null,null,null,null,null,null,null,null,null,"Oaxaca",20,"Tamazulápam del Espíritu Santo","031"]
[null,null,null,null,null,null,null,null,null,"Oaxaca",20,"Fresnillo de Trujano","032"]
[null,null,null,null,null,null,null,null,null,"Oaxaca",20,"Guadalupe Etla","033"]
[null,null,null,null,null,null,null,null,null,"Oaxaca",20,"Guadalupe de Ramírez","034"]
[null,null,null,null,null,null,null,null,null,"Oaxaca",20,"Guelatao de Juárez","035"]
[null,null,null,null,null,null,null,null,null,"Oaxaca",20,"Guevea de Humboldt","036"]
[null,null,null,null,null,null,null,null,null,"Oaxaca",20,"Mesones Hidalgo","037"]
[null,null,null,null,null,null,null,null,null,"Oaxaca",20,"Villa Hidalgo Yalálag","038"]
[null,null,null,null,null,null,null,null,null,"Oaxaca",20,"Heroica Ciudad de Huajuapan de León","039"]
[null,null,null,null,null,null,null,null,null,"Oaxaca",20,"Huautepec","040"]
[null,null,null,null,null,null,null,null,null,"Oaxaca",20,"Huautla de Jiménez","041"]
[null,null,null,null,null,null,null,null,null,"Oaxaca",20,"Ixtlán de Juárez","042"]
[null,null,null,null,null,null,null,null,null,"Oaxaca",20,"Heroica Ciudad de Juchitán de Zaragoza","043"]
[null,null,null,null,null,null,null,null,null,"Oaxaca",20,"Loma Bonita","044"]
[null,null,null,null,null,null,null,null,null,"Oaxaca",20,"Magdalena Apasco","045"]
[null,null,null,null,null,null,null,null,null,"Oaxaca",20,"Magdalena Jaltepec","046"]
[null,null,null,null,null,null,null,null,null,"Oaxaca",20,"Santa Magdalena Jicotlán","047"]
[null,null,null,null,null,null,null,null,null,"Oaxaca",20,"Magdalena Mixtepec","048"]
[null,null,null,null,null,null,null,null,null,"Oaxaca",20,"Magdalena Ocotlán","049"]
[null,null,null,null,null,null,null,null,null,"Oaxaca",20,"Magdalena Peñasco","050"]
[null,null,null,null,null,null,null,null,null,"Oaxaca",20,"Magdalena Teitipac","051"]
[null,null,null,null,null,null,null,null,null,"Oaxaca",20,"Magdalena Tequisistlán","052"]
[null,null,null,null,null,null,null,null,null,"Oaxaca",20,"Magdalena Tlacotepec","053"]
[null,null,null,null,null,null,null,null,null,"Oaxaca",20,"Magdalena Zahuatlán","054"]
[null,null,null,null,null,null,null,null,null,"Oaxaca",20,"Mariscala de Juárez","055"]
[null,null,null,null,null,null,null,null,null,"Oaxaca",20,"Mártires de Tacubaya","056"]
[null,null,null,null,null,null,null,null,null,"Oaxaca",20,"Matías Romero Avendaño","057"]
[null,null,null,null,null,null,null,null,null,"Oaxaca",20,"Mazatlán Villa de Flores","058"]
[null,null,null,null,null,null,null,null,null,"Oaxaca",20,"Miahuatlán de Porfirio Díaz","059"]
[null,null,null,null,null,null,null,null,null,"Oaxaca",20,"Mixistlán de la Reforma","060"]
[null,null,null,null,null,null,null,null,null,"Oaxaca",20,"Monjas","061"]
[null,null,null,null,null,null,null,null,null,"Oaxaca",20,"Natividad","062"]
[null,null,null,null,null,null,null,null,null,"Oaxaca",20,"Nazareno Etla","063"]
[null,null,null,null,null,null,null,null,null,"Oaxaca",20,"Nejapa de Madero","064"]
[null,null,null,null,null,null,null,null,null,"Oaxaca",20,"Ixpantepec Nieves","065"]
[null,null,null,null,null,null,null,null,null,"Oaxaca",20,"Santiago Niltepec","066"]
[null,null,null,null,null,null,null,null,null,"Oaxaca",20,"Oaxaca de Juárez","067"]
[null,null,null,null,null,null,null,null,null,"Oaxaca",20,"Ocotlán de Morelos","068"]
[null,null,null,null,null,null,null,null,null,"Oaxaca",20,"La Pe","069"]
[null,null,null,null,null,null,null,null,null,"Oaxaca",20,"Pinotepa de Don Luis","070"]
[null,null,null,null,null,null,null,null,null,"Oaxaca",20,"Pluma Hidalgo","071"]
[null,null,null,null,null,null,null,null,null,"Oaxaca",20,"San José del Progreso","072"]
[null,null,null,null,null,null,null,null,null,"Oaxaca",20,"Putla Villa de Guerrero","073"]
[null,null,null,null,null,null,null,null,null,"Oaxaca",20,"Santa Catarina Quioquitani","074"]
[null,null,null,null,null,null,null,null,null,"Oaxaca",20,"Reforma de Pineda","075"]
[null,null,null,null,null,null,null,null,null,"Oaxaca",20,"La Reforma","076"]
[null,null,null,null,null,null,null,null,null,"Oaxaca",20,"Reyes Etla","077"]
[null,null,null,null,null,null,null,null,null,"Oaxaca",20,"Rojas de Cuauhtémoc","078"]
[null,null,null,null,null,null,null,null,null,"Oaxaca",20,"Salina Cruz","079"]
[null,null,null,null,null,null,null,null,null,"Oaxaca",20,"San Agustín Amatengo","080"]
[null,null,null,null,null,null,null,null,null,"Oaxaca",20,"San Agustín Atenango","081"]
[null,null,null,null,null,null,null,null,null,"Oaxaca",20,"San Agustín Chayuco","082"]
[null,null,null,null,null,null,null,null,null,"Oaxaca",20,"San Agustín de las Juntas","083"]
[null,null,null,null,null,null,null,null,null,"Oaxaca",20,"San Agustín Etla","084"]
[null,null,null,null,null,null,null,null,null,"Oaxaca",20,"San Agustín Loxicha","085"]
[null,null,null,null,null,null,null,null,null,"Oaxaca",20,"San Agustín Tlacotepec","086"]
[null,null,null,null,null,null,null,null,null,"Oaxaca",20,"San Agustín Yatareni","087"]
[null,null,null,null,null,null,null,null,null,"Oaxaca",20,"San Andrés Cabecera Nueva","088"]
[null,null,null,null,null,null,null,null,null,"Oaxaca",20,"San Andrés Dinicuiti","089"]
[null,null,null,null,null,null,null,null,null,"Oaxaca",20,"San Andrés Huaxpaltepec","090"]
[null,null,null,null,null,null,null,null,null,"Oaxaca",20,"San Andrés Huayápam","091"]
[null,null,null,null,null,null,null,null,null,"Oaxaca",20,"San Andrés Ixtlahuaca","092"]
[null,null,null,null,null,null,null,null,null,"Oaxaca",20,"San Andrés Lagunas","093"]
[null,null,null,null,null,null,null,null,null,"Oaxaca",20,"San Andrés Nuxiño","094"]
[null,null,null,null,null,null,null,null,null,"Oaxaca",20,"San Andrés Paxtlán","095"]
[null,null,null,null,null,null,null,null,null,"Oaxaca",20,"San Andrés Sinaxtla","096"]
[null,null,null,null,null,null,null,null,null,"Oaxaca",20,"San Andrés Solaga","097"]
[null,null,null,null,null,null,null,null,null,"Oaxaca",20,"San Andrés Teotilálpam","098"]
[null,null,null,null,null,null,null,null,null,"Oaxaca",20,"San Andrés Tepetlapa","099"]
[null,null,null,null,null,null,null,null,null,"Oaxaca",20,"San Andrés Yaá",100]
[null,null,null,null,null,null,null,null,null,"Oaxaca",20,"San Andrés Zabache",101]
[null,null,null,null,null,null,null,null,null,"Oaxaca",20,"San Andrés Zautla",102]
[null,null,null,null,null,null,null,null,null,"Oaxaca",20,"San Antonino Castillo Velasco",103]
[null,null,null,null,null,null,null,null,null,"Oaxaca",20,"San Antonino el Alto",104]
[null,null,null,null,null,null,null,null,null,"Oaxaca",20,"San Antonino Monte Verde",105]
[null,null,null,null,null,null,null,null,null,"Oaxaca",20,"San Antonio Acutla",106]
[null,null,null,null,null,null,null,null,null,"Oaxaca",20,"San Antonio de la Cal",107]
[null,null,null,null,null,null,null,null,null,"Oaxaca",20,"San Antonio Huitepec",108]
[null,null,null,null,null,null,null,null,null,"Oaxaca",20,"San Antonio Nanahuatípam",109]
[null,null,null,null,null,null,null,null,null,"Oaxaca",20,"San Antonio Sinicahua",110]
[null,null,null,null,null,null,null,null,null,"Oaxaca",20,"San Antonio Tepetlapa",111]
[null,null,null,null,null,null,null,null,null,"Oaxaca",20,"San Baltazar Chichicápam",112]
[null,null,null,null,null,null,null,null,null,"Oaxaca",20,"San Baltazar Loxicha",113]
[null,null,null,null,null,null,null,null,null,"Oaxaca",20,"San Baltazar Yatzachi el Bajo",114]
[null,null,null,null,null,null,null,null,null,"Oaxaca",20,"San Bartolo Coyotepec",115]
[null,null,null,null,null,null,null,null,null,"Oaxaca",20,"San Bartolomé Ayautla",116]
[null,null,null,null,null,null,null,null,null,"Oaxaca",20,"San Bartolomé Loxicha",117]
[null,null,null,null,null,null,null,null,null,"Oaxaca",20,"San Bartolomé Quialana",118]
[null,null,null,null,null,null,null,null,null,"Oaxaca",20,"San Bartolomé Yucuañe",119]
[null,null,null,null,null,null,null,null,null,"Oaxaca",20,"San Bartolomé Zoogocho",120]
[null,null,null,null,null,null,null,null,null,"Oaxaca",20,"San Bartolo Soyaltepec",121]
[null,null,null,null,null,null,null,null,null,"Oaxaca",20,"San Bartolo Yautepec",122]
[null,null,null,null,null,null,null,null,null,"Oaxaca",20,"San Bernardo Mixtepec",123]
[null,null,null,null,null,null,null,null,null,"Oaxaca",20,"Heroica Villa de San Blas Atempa",124]
[null,null,null,null,null,null,null,null,null,"Oaxaca",20,"San Carlos Yautepec",125]
[null,null,null,null,null,null,null,null,null,"Oaxaca",20,"San Cristóbal Amatlán",126]
[null,null,null,null,null,null,null,null,null,"Oaxaca",20,"San Cristóbal Amoltepec",127]
[null,null,null,null,null,null,null,null,null,"Oaxaca",20,"San Cristóbal Lachirioag",128]
[null,null,null,null,null,null,null,null,null,"Oaxaca",20,"San Cristóbal Suchixtlahuaca",129]
[null,null,null,null,null,null,null,null,null,"Oaxaca",20,"San Dionisio del Mar",130]
[null,null,null,null,null,null,null,null,null,"Oaxaca",20,"San Dionisio Ocotepec",131]
[null,null,null,null,null,null,null,null,null,"Oaxaca",20,"San Dionisio Ocotlán",132]
[null,null,null,null,null,null,null,null,null,"Oaxaca",20,"San Esteban Atatlahuca",133]
[null,null,null,null,null,null,null,null,null,"Oaxaca",20,"San Felipe Jalapa de Díaz",134]
[null,null,null,null,null,null,null,null,null,"Oaxaca",20,"San Felipe Tejalápam",135]
[null,null,null,null,null,null,null,null,null,"Oaxaca",20,"San Felipe Usila",136]
[null,null,null,null,null,null,null,null,null,"Oaxaca",20,"San Francisco Cahuacuá",137]
[null,null,null,null,null,null,null,null,null,"Oaxaca",20,"San Francisco Cajonos",138]
[null,null,null,null,null,null,null,null,null,"Oaxaca",20,"San Francisco Chapulapa",139]
[null,null,null,null,null,null,null,null,null,"Oaxaca",20,"San Francisco Chindúa",140]
[null,null,null,null,null,null,null,null,null,"Oaxaca",20,"San Francisco del Mar",141]
[null,null,null,null,null,null,null,null,null,"Oaxaca",20,"San Francisco Huehuetlán",142]
[null,null,null,null,null,null,null,null,null,"Oaxaca",20,"San Francisco Ixhuatán",143]
[null,null,null,null,null,null,null,null,null,"Oaxaca",20,"San Francisco Jaltepetongo",144]
[null,null,null,null,null,null,null,null,null,"Oaxaca",20,"San Francisco Lachigoló",145]
[null,null,null,null,null,null,null,null,null,"Oaxaca",20,"San Francisco Logueche",146]
[null,null,null,null,null,null,null,null,null,"Oaxaca",20,"San Francisco Nuxaño",147]
[null,null,null,null,null,null,null,null,null,"Oaxaca",20,"San Francisco Ozolotepec",148]
[null,null,null,null,null,null,null,null,null,"Oaxaca",20,"San Francisco Sola",149]
[null,null,null,null,null,null,null,null,null,"Oaxaca",20,"San Francisco Telixtlahuaca",150]
[null,null,null,null,null,null,null,null,null,"Oaxaca",20,"San Francisco Teopan",151]
[null,null,null,null,null,null,null,null,null,"Oaxaca",20,"San Francisco Tlapancingo",152]
[null,null,null,null,null,null,null,null,null,"Oaxaca",20,"San Gabriel Mixtepec",153]
[null,null,null,null,null,null,null,null,null,"Oaxaca",20,"San Ildefonso Amatlán",154]
[null,null,null,null,null,null,null,null,null,"Oaxaca",20,"San Ildefonso Sola",155]
[null,null,null,null,null,null,null,null,null,"Oaxaca",20,"San Ildefonso Villa Alta",156]
[null,null,null,null,null,null,null,null,null,"Oaxaca",20,"San Jacinto Amilpas",157]
[null,null,null,null,null,null,null,null,null,"Oaxaca",20,"San Jacinto Tlacotepec",158]
[null,null,null,null,null,null,null,null,null,"Oaxaca",20,"San Jerónimo Coatlán",159]
[null,null,null,null,null,null,null,null,null,"Oaxaca",20,"San Jerónimo Silacayoapilla",160]
[null,null,null,null,null,null,null,null,null,"Oaxaca",20,"San Jerónimo Sosola",161]
[null,null,null,null,null,null,null,null,null,"Oaxaca",20,"San Jerónimo Taviche",162]
[null,null,null,null,null,null,null,null,null,"Oaxaca",20,"San Jerónimo Tecóatl",163]
[null,null,null,null,null,null,null,null,null,"Oaxaca",20,"San Jorge Nuchita",164]
[null,null,null,null,null,null,null,null,null,"Oaxaca",20,"San José Ayuquila",165]
[null,null,null,null,null,null,null,null,null,"Oaxaca",20,"San José Chiltepec",166]
[null,null,null,null,null,null,null,null,null,"Oaxaca",20,"San José del Peñasco",167]
[null,null,null,null,null,null,null,null,null,"Oaxaca",20,"San José Estancia Grande",168]
[null,null,null,null,null,null,null,null,null,"Oaxaca",20,"San José Independencia",169]
[null,null,null,null,null,null,null,null,null,"Oaxaca",20,"San José Lachiguiri",170]
[null,null,null,null,null,null,null,null,null,"Oaxaca",20,"San José Tenango",171]
[null,null,null,null,null,null,null,null,null,"Oaxaca",20,"San Juan Achiutla",172]
[null,null,null,null,null,null,null,null,null,"Oaxaca",20,"San Juan Atepec",173]
[null,null,null,null,null,null,null,null,null,"Oaxaca",20,"Ánimas Trujano",174]
[null,null,null,null,null,null,null,null,null,"Oaxaca",20,"San Juan Bautista Atatlahuca",175]
[null,null,null,null,null,null,null,null,null,"Oaxaca",20,"San Juan Bautista Coixtlahuaca",176]
[null,null,null,null,null,null,null,null,null,"Oaxaca",20,"San Juan Bautista Cuicatlán",177]
[null,null,null,null,null,null,null,null,null,"Oaxaca",20,"San Juan Bautista Guelache",178]
[null,null,null,null,null,null,null,null,null,"Oaxaca",20,"San Juan Bautista Jayacatlán",179]
[null,null,null,null,null,null,null,null,null,"Oaxaca",20,"San Juan Bautista Lo de Soto",180]
[null,null,null,null,null,null,null,null,null,"Oaxaca",20,"San Juan Bautista Suchitepec",181]
[null,null,null,null,null,null,null,null,null,"Oaxaca",20,"San Juan Bautista Tlacoatzintepec",182]
[null,null,null,null,null,null,null,null,null,"Oaxaca",20,"San Juan Bautista Tlachichilco",183]
[null,null,null,null,null,null,null,null,null,"Oaxaca",20,"San Juan Bautista Tuxtepec",184]
[null,null,null,null,null,null,null,null,null,"Oaxaca",20,"San Juan Cacahuatepec",185]
[null,null,null,null,null,null,null,null,null,"Oaxaca",20,"San Juan Cieneguilla",186]
[null,null,null,null,null,null,null,null,null,"Oaxaca",20,"San Juan Coatzóspam",187]
[null,null,null,null,null,null,null,null,null,"Oaxaca",20,"San Juan Colorado",188]
[null,null,null,null,null,null,null,null,null,"Oaxaca",20,"San Juan Comaltepec",189]
[null,null,null,null,null,null,null,null,null,"Oaxaca",20,"San Juan Cotzocón",190]
[null,null,null,null,null,null,null,null,null,"Oaxaca",20,"San Juan Chicomezúchil",191]
[null,null,null,null,null,null,null,null,null,"Oaxaca",20,"San Juan Chilateca",192]
[null,null,null,null,null,null,null,null,null,"Oaxaca",20,"San Juan del Estado",193]
[null,null,null,null,null,null,null,null,null,"Oaxaca",20,"San Juan del Río",194]
[null,null,null,null,null,null,null,null,null,"Oaxaca",20,"San Juan Diuxi",195]
[null,null,null,null,null,null,null,null,null,"Oaxaca",20,"San Juan Evangelista Analco",196]
[null,null,null,null,null,null,null,null,null,"Oaxaca",20,"San Juan Guelavía",197]
[null,null,null,null,null,null,null,null,null,"Oaxaca",20,"San Juan Guichicovi",198]
[null,null,null,null,null,null,null,null,null,"Oaxaca",20,"San Juan Ihualtepec",199]
[null,null,null,null,null,null,null,null,null,"Oaxaca",20,"San Juan Juquila Mixes",200]
[null,null,null,null,null,null,null,null,null,"Oaxaca",20,"San Juan Juquila Vijanos",201]
[null,null,null,null,null,null,null,null,null,"Oaxaca",20,"San Juan Lachao",202]
[null,null,null,null,null,null,null,null,null,"Oaxaca",20,"San Juan Lachigalla",203]
[null,null,null,null,null,null,null,null,null,"Oaxaca",20,"San Juan Lajarcia",204]
[null,null,null,null,null,null,null,null,null,"Oaxaca",20,"San Juan Lalana",205]
[null,null,null,null,null,null,null,null,null,"Oaxaca",20,"San Juan de los Cués",206]
[null,null,null,null,null,null,null,null,null,"Oaxaca",20,"San Juan Mazatlán",207]
[null,null,null,null,null,null,null,null,null,"Oaxaca",20,"San Juan Mixtepec -Dto. 08 -",208]
[null,null,null,null,null,null,null,null,null,"Oaxaca",20,"San Juan Mixtepec -Dto. 26 -",209]
[null,null,null,null,null,null,null,null,null,"Oaxaca",20,"San Juan Ñumí",210]
[null,null,null,null,null,null,null,null,null,"Oaxaca",20,"San Juan Ozolotepec",211]
[null,null,null,null,null,null,null,null,null,"Oaxaca",20,"San Juan Petlapa",212]
[null,null,null,null,null,null,null,null,null,"Oaxaca",20,"San Juan Quiahije",213]
[null,null,null,null,null,null,null,null,null,"Oaxaca",20,"San Juan Quiotepec",214]
[null,null,null,null,null,null,null,null,null,"Oaxaca",20,"San Juan Sayultepec",215]
[null,null,null,null,null,null,null,null,null,"Oaxaca",20,"San Juan Tabaá",216]
[null,null,null,null,null,null,null,null,null,"Oaxaca",20,"San Juan Tamazola",217]
[null,null,null,null,null,null,null,null,null,"Oaxaca",20,"San Juan Teita",218]
[null,null,null,null,null,null,null,null,null,"Oaxaca",20,"San Juan Teitipac",219]
[null,null,null,null,null,null,null,null,null,"Oaxaca",20,"San Juan Tepeuxila",220]
[null,null,null,null,null,null,null,null,null,"Oaxaca",20,"San Juan Teposcolula",221]
[null,null,null,null,null,null,null,null,null,"Oaxaca",20,"San Juan Yaeé",222]
[null,null,null,null,null,null,null,null,null,"Oaxaca",20,"San Juan Yatzona",223]
[null,null,null,null,null,null,null,null,null,"Oaxaca",20,"San Juan Yucuita",224]
[null,null,null,null,null,null,null,null,null,"Oaxaca",20,"San Lorenzo",225]
[null,null,null,null,null,null,null,null,null,"Oaxaca",20,"San Lorenzo Albarradas",226]
[null,null,null,null,null,null,null,null,null,"Oaxaca",20,"San Lorenzo Cacaotepec",227]
[null,null,null,null,null,null,null,null,null,"Oaxaca",20,"San Lorenzo Cuaunecuiltitla",228]
[null,null,null,null,null,null,null,null,null,"Oaxaca",20,"San Lorenzo Texmelúcan",229]
[null,null,null,null,null,null,null,null,null,"Oaxaca",20,"San Lorenzo Victoria",230]
[null,null,null,null,null,null,null,null,null,"Oaxaca",20,"San Lucas Camotlán",231]
[null,null,null,null,null,null,null,null,null,"Oaxaca",20,"San Lucas Ojitlán",232]
[null,null,null,null,null,null,null,null,null,"Oaxaca",20,"San Lucas Quiaviní",233]
[null,null,null,null,null,null,null,null,null,"Oaxaca",20,"San Lucas Zoquiápam",234]
[null,null,null,null,null,null,null,null,null,"Oaxaca",20,"San Luis Amatlán",235]
[null,null,null,null,null,null,null,null,null,"Oaxaca",20,"San Marcial Ozolotepec",236]
[null,null,null,null,null,null,null,null,null,"Oaxaca",20,"San Marcos Arteaga",237]
[null,null,null,null,null,null,null,null,null,"Oaxaca",20,"Heroico San Martín de los Cansecos",238]
[null,null,null,null,null,null,null,null,null,"Oaxaca",20,"San Martín Huamelúlpam",239]
[null,null,null,null,null,null,null,null,null,"Oaxaca",20,"San Martín Itunyoso",240]
[null,null,null,null,null,null,null,null,null,"Oaxaca",20,"San Martín Lachilá",241]
[null,null,null,null,null,null,null,null,null,"Oaxaca",20,"San Martín Peras",242]
[null,null,null,null,null,null,null,null,null,"Oaxaca",20,"San Martín Tilcajete",243]
[null,null,null,null,null,null,null,null,null,"Oaxaca",20,"San Martín Toxpalan",244]
[null,null,null,null,null,null,null,null,null,"Oaxaca",20,"San Martín Zacatepec",245]
[null,null,null,null,null,null,null,null,null,"Oaxaca",20,"San Mateo Cajonos",246]
[null,null,null,null,null,null,null,null,null,"Oaxaca",20,"Capulálpam de Méndez",247]
[null,null,null,null,null,null,null,null,null,"Oaxaca",20,"San Mateo del Mar",248]
[null,null,null,null,null,null,null,null,null,"Oaxaca",20,"San Mateo Yoloxochitlán",249]
[null,null,null,null,null,null,null,null,null,"Oaxaca",20,"San Mateo Etlatongo",250]
[null,null,null,null,null,null,null,null,null,"Oaxaca",20,"San Mateo Nejápam",251]
[null,null,null,null,null,null,null,null,null,"Oaxaca",20,"San Mateo Peñasco",252]
[null,null,null,null,null,null,null,null,null,"Oaxaca",20,"San Mateo Piñas",253]
[null,null,null,null,null,null,null,null,null,"Oaxaca",20,"San Mateo Río Hondo",254]
[null,null,null,null,null,null,null,null,null,"Oaxaca",20,"San Mateo Sindihui",255]
[null,null,null,null,null,null,null,null,null,"Oaxaca",20,"San Mateo Tlapiltepec",256]
[null,null,null,null,null,null,null,null,null,"Oaxaca",20,"San Melchor Betaza",257]
[null,null,null,null,null,null,null,null,null,"Oaxaca",20,"San Miguel Achiutla",258]
[null,null,null,null,null,null,null,null,null,"Oaxaca",20,"San Miguel Ahuehuetitlán",259]
[null,null,null,null,null,null,null,null,null,"Oaxaca",20,"San Miguel Aloápam",260]
[null,null,null,null,null,null,null,null,null,"Oaxaca",20,"San Miguel Amatitlán",261]
[null,null,null,null,null,null,null,null,null,"Oaxaca",20,"San Miguel Amatlán",262]
[null,null,null,null,null,null,null,null,null,"Oaxaca",20,"San Miguel Coatlán",263]
[null,null,null,null,null,null,null,null,null,"Oaxaca",20,"San Miguel Chicahua",264]
[null,null,null,null,null,null,null,null,null,"Oaxaca",20,"San Miguel Chimalapa",265]
[null,null,null,null,null,null,null,null,null,"Oaxaca",20,"San Miguel del Puerto",266]
[null,null,null,null,null,null,null,null,null,"Oaxaca",20,"San Miguel del Río",267]
[null,null,null,null,null,null,null,null,null,"Oaxaca",20,"San Miguel Ejutla",268]
[null,null,null,null,null,null,null,null,null,"Oaxaca",20,"San Miguel el Grande",269]
[null,null,null,null,null,null,null,null,null,"Oaxaca",20,"San Miguel Huautla",270]
[null,null,null,null,null,null,null,null,null,"Oaxaca",20,"San Miguel Mixtepec",271]
[null,null,null,null,null,null,null,null,null,"Oaxaca",20,"San Miguel Panixtlahuaca",272]
[null,null,null,null,null,null,null,null,null,"Oaxaca",20,"San Miguel Peras",273]
[null,null,null,null,null,null,null,null,null,"Oaxaca",20,"San Miguel Piedras",274]
[null,null,null,null,null,null,null,null,null,"Oaxaca",20,"San Miguel Quetzaltepec",275]
[null,null,null,null,null,null,null,null,null,"Oaxaca",20,"San Miguel Santa Flor",276]
[null,null,null,null,null,null,null,null,null,"Oaxaca",20,"Villa Sola de Vega",277]
[null,null,null,null,null,null,null,null,null,"Oaxaca",20,"San Miguel Soyaltepec",278]
[null,null,null,null,null,null,null,null,null,"Oaxaca",20,"San Miguel Suchixtepec",279]
[null,null,null,null,null,null,null,null,null,"Oaxaca",20,"Villa Talea de Castro",280]
[null,null,null,null,null,null,null,null,null,"Oaxaca",20,"San Miguel Tecomatlán",281]
[null,null,null,null,null,null,null,null,null,"Oaxaca",20,"San Miguel Tenango",282]
[null,null,null,null,null,null,null,null,null,"Oaxaca",20,"San Miguel Tequixtepec",283]
[null,null,null,null,null,null,null,null,null,"Oaxaca",20,"San Miguel Tilquiápam",284]
[null,null,null,null,null,null,null,null,null,"Oaxaca",20,"San Miguel Tlacamama",285]
[null,null,null,null,null,null,null,null,null,"Oaxaca",20,"San Miguel Tlacotepec",286]
[null,null,null,null,null,null,null,null,null,"Oaxaca",20,"San Miguel Tulancingo",287]
[null,null,null,null,null,null,null,null,null,"Oaxaca",20,"San Miguel Yotao",288]
[null,null,null,null,null,null,null,null,null,"Oaxaca",20,"San Nicolás",289]
[null,null,null,null,null,null,null,null,null,"Oaxaca",20,"San Nicolás Hidalgo",290]
[null,null,null,null,null,null,null,null,null,"Oaxaca",20,"San Pablo Coatlán",291]
[null,null,null,null,null,null,null,null,null,"Oaxaca",20,"San Pablo Cuatro Venados",292]
[null,null,null,null,null,null,null,null,null,"Oaxaca",20,"San Pablo Etla",293]
[null,null,null,null,null,null,null,null,null,"Oaxaca",20,"San Pablo Huitzo",294]
[null,null,null,null,null,null,null,null,null,"Oaxaca",20,"San Pablo Huixtepec",295]
[null,null,null,null,null,null,null,null,null,"Oaxaca",20,"San Pablo Macuiltianguis",296]
[null,null,null,null,null,null,null,null,null,"Oaxaca",20,"San Pablo Tijaltepec",297]
[null,null,null,null,null,null,null,null,null,"Oaxaca",20,"San Pablo Villa de Mitla",298]
[null,null,null,null,null,null,null,null,null,"Oaxaca",20,"San Pablo Yaganiza",299]
[null,null,null,null,null,null,null,null,null,"Oaxaca",20,"San Pedro Amuzgos",300]
[null,null,null,null,null,null,null,null,null,"Oaxaca",20,"San Pedro Apóstol",301]
[null,null,null,null,null,null,null,null,null,"Oaxaca",20,"San Pedro Atoyac",302]
[null,null,null,null,null,null,null,null,null,"Oaxaca",20,"San Pedro Cajonos",303]
[null,null,null,null,null,null,null,null,null,"Oaxaca",20,"San Pedro Coxcaltepec Cántaros",304]
[null,null,null,null,null,null,null,null,null,"Oaxaca",20,"San Pedro Comitancillo",305]
[null,null,null,null,null,null,null,null,null,"Oaxaca",20,"San Pedro el Alto",306]
[null,null,null,null,null,null,null,null,null,"Oaxaca",20,"San Pedro Huamelula",307]
[null,null,null,null,null,null,null,null,null,"Oaxaca",20,"San Pedro Huilotepec",308]
[null,null,null,null,null,null,null,null,null,"Oaxaca",20,"San Pedro Ixcatlán",309]
[null,null,null,null,null,null,null,null,null,"Oaxaca",20,"San Pedro Ixtlahuaca",310]
[null,null,null,null,null,null,null,null,null,"Oaxaca",20,"San Pedro Jaltepetongo",311]
[null,null,null,null,null,null,null,null,null,"Oaxaca",20,"San Pedro Jicayán",312]
[null,null,null,null,null,null,null,null,null,"Oaxaca",20,"San Pedro Jocotipac",313]
[null,null,null,null,null,null,null,null,null,"Oaxaca",20,"San Pedro Juchatengo",314]
[null,null,null,null,null,null,null,null,null,"Oaxaca",20,"San Pedro Mártir",315]
[null,null,null,null,null,null,null,null,null,"Oaxaca",20,"San Pedro Mártir Quiechapa",316]
[null,null,null,null,null,null,null,null,null,"Oaxaca",20,"San Pedro Mártir Yucuxaco",317]
[null,null,null,null,null,null,null,null,null,"Oaxaca",20,"San Pedro Mixtepec -Dto. 22 -",318]
[null,null,null,null,null,null,null,null,null,"Oaxaca",20,"San Pedro Mixtepec -Dto. 26 -",319]
[null,null,null,null,null,null,null,null,null,"Oaxaca",20,"San Pedro Molinos",320]
[null,null,null,null,null,null,null,null,null,"Oaxaca",20,"San Pedro Nopala",321]
[null,null,null,null,null,null,null,null,null,"Oaxaca",20,"San Pedro Ocopetatillo",322]
[null,null,null,null,null,null,null,null,null,"Oaxaca",20,"San Pedro Ocotepec",323]
[null,null,null,null,null,null,null,null,null,"Oaxaca",20,"San Pedro Pochutla",324]
[null,null,null,null,null,null,null,null,null,"Oaxaca",20,"San Pedro Quiatoni",325]
[null,null,null,null,null,null,null,null,null,"Oaxaca",20,"San Pedro Sochiápam",326]
[null,null,null,null,null,null,null,null,null,"Oaxaca",20,"San Pedro Tapanatepec",327]
[null,null,null,null,null,null,null,null,null,"Oaxaca",20,"San Pedro Taviche",328]
[null,null,null,null,null,null,null,null,null,"Oaxaca",20,"San Pedro Teozacoalco",329]
[null,null,null,null,null,null,null,null,null,"Oaxaca",20,"San Pedro Teutila",330]
[null,null,null,null,null,null,null,null,null,"Oaxaca",20,"San Pedro Tidaá",331]
[null,null,null,null,null,null,null,null,null,"Oaxaca",20,"San Pedro Topiltepec",332]
[null,null,null,null,null,null,null,null,null,"Oaxaca",20,"San Pedro Totolápam",333]
[null,null,null,null,null,null,null,null,null,"Oaxaca",20,"Villa de Tututepec",334]
[null,null,null,null,null,null,null,null,null,"Oaxaca",20,"San Pedro Yaneri",335]
[null,null,null,null,null,null,null,null,null,"Oaxaca",20,"San Pedro Yólox",336]
[null,null,null,null,null,null,null,null,null,"Oaxaca",20,"San Pedro y San Pablo Ayutla",337]
[null,null,null,null,null,null,null,null,null,"Oaxaca",20,"Villa de Etla",338]
[null,null,null,null,null,null,null,null,null,"Oaxaca",20,"San Pedro y San Pablo Teposcolula",339]
[null,null,null,null,null,null,null,null,null,"Oaxaca",20,"San Pedro y San Pablo Tequixtepec",340]
[null,null,null,null,null,null,null,null,null,"Oaxaca",20,"San Pedro Yucunama",341]
[null,null,null,null,null,null,null,null,null,"Oaxaca",20,"San Raymundo Jalpan",342]
[null,null,null,null,null,null,null,null,null,"Oaxaca",20,"San Sebastián Abasolo",343]
[null,null,null,null,null,null,null,null,null,"Oaxaca",20,"San Sebastián Coatlán",344]
[null,null,null,null,null,null,null,null,null,"Oaxaca",20,"San Sebastián Ixcapa",345]
[null,null,null,null,null,null,null,null,null,"Oaxaca",20,"San Sebastián Nicananduta",346]
[null,null,null,null,null,null,null,null,null,"Oaxaca",20,"San Sebastián Río Hondo",347]
[null,null,null,null,null,null,null,null,null,"Oaxaca",20,"San Sebastián Tecomaxtlahuaca",348]
[null,null,null,null,null,null,null,null,null,"Oaxaca",20,"San Sebastián Teitipac",349]
[null,null,null,null,null,null,null,null,null,"Oaxaca",20,"San Sebastián Tutla",350]
[null,null,null,null,null,null,null,null,null,"Oaxaca",20,"San Simón Almolongas",351]
[null,null,null,null,null,null,null,null,null,"Oaxaca",20,"San Simón Zahuatlán",352]
[null,null,null,null,null,null,null,null,null,"Oaxaca",20,"Santa Ana",353]
[null,null,null,null,null,null,null,null,null,"Oaxaca",20,"Santa Ana Ateixtlahuaca",354]
[null,null,null,null,null,null,null,null,null,"Oaxaca",20,"Santa Ana Cuauhtémoc",355]
[null,null,null,null,null,null,null,null,null,"Oaxaca",20,"Santa Ana del Valle",356]
[null,null,null,null,null,null,null,null,null,"Oaxaca",20,"Santa Ana Tavela",357]
[null,null,null,null,null,null,null,null,null,"Oaxaca",20,"Santa Ana Tlapacoyan",358]
[null,null,null,null,null,null,null,null,null,"Oaxaca",20,"Santa Ana Yareni",359]
[null,null,null,null,null,null,null,null,null,"Oaxaca",20,"Santa Ana Zegache",360]
[null,null,null,null,null,null,null,null,null,"Oaxaca",20,"Santa Catalina Quierí",361]
[null,null,null,null,null,null,null,null,null,"Oaxaca",20,"Santa Catarina Cuixtla",362]
[null,null,null,null,null,null,null,null,null,"Oaxaca",20,"Santa Catarina Ixtepeji",363]
[null,null,null,null,null,null,null,null,null,"Oaxaca",20,"Santa Catarina Juquila",364]
[null,null,null,null,null,null,null,null,null,"Oaxaca",20,"Santa Catarina Lachatao",365]
[null,null,null,null,null,null,null,null,null,"Oaxaca",20,"Santa Catarina Loxicha",366]
[null,null,null,null,null,null,null,null,null,"Oaxaca",20,"Santa Catarina Mechoacán",367]
[null,null,null,null,null,null,null,null,null,"Oaxaca",20,"Santa Catarina Minas",368]
[null,null,null,null,null,null,null,null,null,"Oaxaca",20,"Santa Catarina Quiané",369]
[null,null,null,null,null,null,null,null,null,"Oaxaca",20,"Santa Catarina Tayata",370]
[null,null,null,null,null,null,null,null,null,"Oaxaca",20,"Santa Catarina Ticuá",371]
[null,null,null,null,null,null,null,null,null,"Oaxaca",20,"Santa Catarina Yosonotú",372]
[null,null,null,null,null,null,null,null,null,"Oaxaca",20,"Santa Catarina Zapoquila",373]
[null,null,null,null,null,null,null,null,null,"Oaxaca",20,"Santa Cruz Acatepec",374]
[null,null,null,null,null,null,null,null,null,"Oaxaca",20,"Santa Cruz Amilpas",375]
[null,null,null,null,null,null,null,null,null,"Oaxaca",20,"Santa Cruz de Bravo",376]
[null,null,null,null,null,null,null,null,null,"Oaxaca",20,"Santa Cruz Itundujia",377]
[null,null,null,null,null,null,null,null,null,"Oaxaca",20,"Santa Cruz Mixtepec",378]
[null,null,null,null,null,null,null,null,null,"Oaxaca",20,"Santa Cruz Nundaco",379]
[null,null,null,null,null,null,null,null,null,"Oaxaca",20,"Santa Cruz Papalutla",380]
[null,null,null,null,null,null,null,null,null,"Oaxaca",20,"Santa Cruz Tacache de Mina",381]
[null,null,null,null,null,null,null,null,null,"Oaxaca",20,"Santa Cruz Tacahua",382]
[null,null,null,null,null,null,null,null,null,"Oaxaca",20,"Santa Cruz Tayata",383]
[null,null,null,null,null,null,null,null,null,"Oaxaca",20,"Santa Cruz Xitla",384]
[null,null,null,null,null,null,null,null,null,"Oaxaca",20,"Santa Cruz Xoxocotlán",385]
[null,null,null,null,null,null,null,null,null,"Oaxaca",20,"Santa Cruz Zenzontepec",386]
[null,null,null,null,null,null,null,null,null,"Oaxaca",20,"Santa Gertrudis",387]
[null,null,null,null,null,null,null,null,null,"Oaxaca",20,"Santa Inés del Monte",388]
[null,null,null,null,null,null,null,null,null,"Oaxaca",20,"Santa Inés Yatzeche",389]
[null,null,null,null,null,null,null,null,null,"Oaxaca",20,"Santa Lucía del Camino",390]
[null,null,null,null,null,null,null,null,null,"Oaxaca",20,"Santa Lucía Miahuatlán",391]
[null,null,null,null,null,null,null,null,null,"Oaxaca",20,"Santa Lucía Monteverde",392]
[null,null,null,null,null,null,null,null,null,"Oaxaca",20,"Santa Lucía Ocotlán",393]
[null,null,null,null,null,null,null,null,null,"Oaxaca",20,"Santa María Alotepec",394]
[null,null,null,null,null,null,null,null,null,"Oaxaca",20,"Santa María Apazco",395]
[null,null,null,null,null,null,null,null,null,"Oaxaca",20,"Santa María la Asunción",396]
[null,null,null,null,null,null,null,null,null,"Oaxaca",20,"Heroica Ciudad de Tlaxiaco",397]
[null,null,null,null,null,null,null,null,null,"Oaxaca",20,"Ayoquezco de Aldama",398]
[null,null,null,null,null,null,null,null,null,"Oaxaca",20,"Santa María Atzompa",399]
[null,null,null,null,null,null,null,null,null,"Oaxaca",20,"Santa María Camotlán",400]
[null,null,null,null,null,null,null,null,null,"Oaxaca",20,"Santa María Colotepec",401]
[null,null,null,null,null,null,null,null,null,"Oaxaca",20,"Santa María Cortijo",402]
[null,null,null,null,null,null,null,null,null,"Oaxaca",20,"Santa María Coyotepec",403]
[null,null,null,null,null,null,null,null,null,"Oaxaca",20,"Santa María Chachoápam",404]
[null,null,null,null,null,null,null,null,null,"Oaxaca",20,"Villa de Chilapa de Díaz",405]
[null,null,null,null,null,null,null,null,null,"Oaxaca",20,"Santa María Chilchotla",406]
[null,null,null,null,null,null,null,null,null,"Oaxaca",20,"Santa María Chimalapa",407]
[null,null,null,null,null,null,null,null,null,"Oaxaca",20,"Santa María del Rosario",408]
[null,null,null,null,null,null,null,null,null,"Oaxaca",20,"Santa María del Tule",409]
[null,null,null,null,null,null,null,null,null,"Oaxaca",20,"Santa María Ecatepec",410]
[null,null,null,null,null,null,null,null,null,"Oaxaca",20,"Santa María Guelacé",411]
[null,null,null,null,null,null,null,null,null,"Oaxaca",20,"Santa María Guienagati",412]
[null,null,null,null,null,null,null,null,null,"Oaxaca",20,"Santa María Huatulco",413]
[null,null,null,null,null,null,null,null,null,"Oaxaca",20,"Santa María Huazolotitlán",414]
[null,null,null,null,null,null,null,null,null,"Oaxaca",20,"Santa María Ipalapa",415]
[null,null,null,null,null,null,null,null,null,"Oaxaca",20,"Santa María Ixcatlán",416]
[null,null,null,null,null,null,null,null,null,"Oaxaca",20,"Santa María Jacatepec",417]
[null,null,null,null,null,null,null,null,null,"Oaxaca",20,"Santa María Jalapa del Marqués",418]
[null,null,null,null,null,null,null,null,null,"Oaxaca",20,"Santa María Jaltianguis",419]
[null,null,null,null,null,null,null,null,null,"Oaxaca",20,"Santa María Lachixío",420]
[null,null,null,null,null,null,null,null,null,"Oaxaca",20,"Santa María Mixtequilla",421]
[null,null,null,null,null,null,null,null,null,"Oaxaca",20,"Santa María Nativitas",422]
[null,null,null,null,null,null,null,null,null,"Oaxaca",20,"Santa María Nduayaco",423]
[null,null,null,null,null,null,null,null,null,"Oaxaca",20,"Santa María Ozolotepec",424]
[null,null,null,null,null,null,null,null,null,"Oaxaca",20,"Santa María Pápalo",425]
[null,null,null,null,null,null,null,null,null,"Oaxaca",20,"Santa María Peñoles",426]
[null,null,null,null,null,null,null,null,null,"Oaxaca",20,"Santa María Petapa",427]
[null,null,null,null,null,null,null,null,null,"Oaxaca",20,"Santa María Quiegolani",428]
[null,null,null,null,null,null,null,null,null,"Oaxaca",20,"Santa María Sola",429]
[null,null,null,null,null,null,null,null,null,"Oaxaca",20,"Santa María Tataltepec",430]
[null,null,null,null,null,null,null,null,null,"Oaxaca",20,"Santa María Tecomavaca",431]
[null,null,null,null,null,null,null,null,null,"Oaxaca",20,"Santa María Temaxcalapa",432]
[null,null,null,null,null,null,null,null,null,"Oaxaca",20,"Santa María Temaxcaltepec",433]
[null,null,null,null,null,null,null,null,null,"Oaxaca",20,"Santa María Teopoxco",434]
[null,null,null,null,null,null,null,null,null,"Oaxaca",20,"Santa María Tepantlali",435]
[null,null,null,null,null,null,null,null,null,"Oaxaca",20,"Santa María Texcatitlán",436]
[null,null,null,null,null,null,null,null,null,"Oaxaca",20,"Santa María Tlahuitoltepec",437]
[null,null,null,null,null,null,null,null,null,"Oaxaca",20,"Santa María Tlalixtac",438]
[null,null,null,null,null,null,null,null,null,"Oaxaca",20,"Santa María Tonameca",439]
[null,null,null,null,null,null,null,null,null,"Oaxaca",20,"Santa María Totolapilla",440]
[null,null,null,null,null,null,null,null,null,"Oaxaca",20,"Santa María Xadani",441]
[null,null,null,null,null,null,null,null,null,"Oaxaca",20,"Santa María Yalina",442]
[null,null,null,null,null,null,null,null,null,"Oaxaca",20,"Santa María Yavesía",443]
[null,null,null,null,null,null,null,null,null,"Oaxaca",20,"Santa María Yolotepec",444]
[null,null,null,null,null,null,null,null,null,"Oaxaca",20,"Santa María Yosoyúa",445]
[null,null,null,null,null,null,null,null,null,"Oaxaca",20,"Santa María Yucuhiti",446]
[null,null,null,null,null,null,null,null,null,"Oaxaca",20,"Santa María Zacatepec",447]
[null,null,null,null,null,null,null,null,null,"Oaxaca",20,"Santa María Zaniza",448]
[null,null,null,null,null,null,null,null,null,"Oaxaca",20,"Santa María Zoquitlán",449]
[null,null,null,null,null,null,null,null,null,"Oaxaca",20,"Santiago Amoltepec",450]
[null,null,null,null,null,null,null,null,null,"Oaxaca",20,"Santiago Apoala",451]
[null,null,null,null,null,null,null,null,null,"Oaxaca",20,"Santiago Apóstol",452]
[null,null,null,null,null,null,null,null,null,"Oaxaca",20,"Santiago Astata",453]
[null,null,null,null,null,null,null,null,null,"Oaxaca",20,"Santiago Atitlán",454]
[null,null,null,null,null,null,null,null,null,"Oaxaca",20,"Santiago Ayuquililla",455]
[null,null,null,null,null,null,null,null,null,"Oaxaca",20,"Santiago Cacaloxtepec",456]
[null,null,null,null,null,null,null,null,null,"Oaxaca",20,"Santiago Camotlán",457]
[null,null,null,null,null,null,null,null,null,"Oaxaca",20,"Santiago Comaltepec",458]
[null,null,null,null,null,null,null,null,null,"Oaxaca",20,"Villa de Santiago Chazumba",459]
[null,null,null,null,null,null,null,null,null,"Oaxaca",20,"Santiago Choápam",460]
[null,null,null,null,null,null,null,null,null,"Oaxaca",20,"Santiago del Río",461]
[null,null,null,null,null,null,null,null,null,"Oaxaca",20,"Santiago Huajolotitlán",462]
[null,null,null,null,null,null,null,null,null,"Oaxaca",20,"Santiago Huauclilla",463]
[null,null,null,null,null,null,null,null,null,"Oaxaca",20,"Santiago Ihuitlán Plumas",464]
[null,null,null,null,null,null,null,null,null,"Oaxaca",20,"Santiago Ixcuintepec",465]
[null,null,null,null,null,null,null,null,null,"Oaxaca",20,"Santiago Ixtayutla",466]
[null,null,null,null,null,null,null,null,null,"Oaxaca",20,"Santiago Jamiltepec",467]
[null,null,null,null,null,null,null,null,null,"Oaxaca",20,"Santiago Jocotepec",468]
[null,null,null,null,null,null,null,null,null,"Oaxaca",20,"Santiago Juxtlahuaca",469]
[null,null,null,null,null,null,null,null,null,"Oaxaca",20,"Santiago Lachiguiri",470]
[null,null,null,null,null,null,null,null,null,"Oaxaca",20,"Santiago Lalopa",471]
[null,null,null,null,null,null,null,null,null,"Oaxaca",20,"Santiago Laollaga",472]
[null,null,null,null,null,null,null,null,null,"Oaxaca",20,"Santiago Laxopa",473]
[null,null,null,null,null,null,null,null,null,"Oaxaca",20,"Santiago Llano Grande",474]
[null,null,null,null,null,null,null,null,null,"Oaxaca",20,"Santiago Matatlán",475]
[null,null,null,null,null,null,null,null,null,"Oaxaca",20,"Santiago Miltepec",476]
[null,null,null,null,null,null,null,null,null,"Oaxaca",20,"Santiago Minas",477]
[null,null,null,null,null,null,null,null,null,"Oaxaca",20,"Santiago Nacaltepec",478]
[null,null,null,null,null,null,null,null,null,"Oaxaca",20,"Santiago Nejapilla",479]
[null,null,null,null,null,null,null,null,null,"Oaxaca",20,"Santiago Nundiche",480]
[null,null,null,null,null,null,null,null,null,"Oaxaca",20,"Santiago Nuyoó",481]
[null,null,null,null,null,null,null,null,null,"Oaxaca",20,"Santiago Pinotepa Nacional",482]
[null,null,null,null,null,null,null,null,null,"Oaxaca",20,"Santiago Suchilquitongo",483]
[null,null,null,null,null,null,null,null,null,"Oaxaca",20,"Santiago Tamazola",484]
[null,null,null,null,null,null,null,null,null,"Oaxaca",20,"Santiago Tapextla",485]
[null,null,null,null,null,null,null,null,null,"Oaxaca",20,"Villa Tejúpam de la Unión",486]
[null,null,null,null,null,null,null,null,null,"Oaxaca",20,"Santiago Tenango",487]
[null,null,null,null,null,null,null,null,null,"Oaxaca",20,"Santiago Tepetlapa",488]
[null,null,null,null,null,null,null,null,null,"Oaxaca",20,"Santiago Tetepec",489]
[null,null,null,null,null,null,null,null,null,"Oaxaca",20,"Santiago Texcalcingo",490]
[null,null,null,null,null,null,null,null,null,"Oaxaca",20,"Santiago Textitlán",491]
[null,null,null,null,null,null,null,null,null,"Oaxaca",20,"Santiago Tilantongo",492]
[null,null,null,null,null,null,null,null,null,"Oaxaca",20,"Santiago Tillo",493]
[null,null,null,null,null,null,null,null,null,"Oaxaca",20,"Santiago Tlazoyaltepec",494]
[null,null,null,null,null,null,null,null,null,"Oaxaca",20,"Santiago Xanica",495]
[null,null,null,null,null,null,null,null,null,"Oaxaca",20,"Santiago Xiacuí",496]
[null,null,null,null,null,null,null,null,null,"Oaxaca",20,"Santiago Yaitepec",497]
[null,null,null,null,null,null,null,null,null,"Oaxaca",20,"Santiago Yaveo",498]
[null,null,null,null,null,null,null,null,null,"Oaxaca",20,"Santiago Yolomécatl",499]
[null,null,null,null,null,null,null,null,null,"Oaxaca",20,"Santiago Yosondúa",500]
[null,null,null,null,null,null,null,null,null,"Oaxaca",20,"Santiago Yucuyachi",501]
[null,null,null,null,null,null,null,null,null,"Oaxaca",20,"Santiago Zacatepec",502]
[null,null,null,null,null,null,null,null,null,"Oaxaca",20,"Santiago Zoochila",503]
[null,null,null,null,null,null,null,null,null,"Oaxaca",20,"Nuevo Zoquiápam",504]
[null,null,null,null,null,null,null,null,null,"Oaxaca",20,"Santo Domingo Ingenio",505]
[null,null,null,null,null,null,null,null,null,"Oaxaca",20,"Santo Domingo Albarradas",506]
[null,null,null,null,null,null,null,null,null,"Oaxaca",20,"Santo Domingo Armenta",507]
[null,null,null,null,null,null,null,null,null,"Oaxaca",20,"Santo Domingo Chihuitán",508]
[null,null,null,null,null,null,null,null,null,"Oaxaca",20,"Santo Domingo de Morelos",509]
[null,null,null,null,null,null,null,null,null,"Oaxaca",20,"Santo Domingo Ixcatlán",510]
[null,null,null,null,null,null,null,null,null,"Oaxaca",20,"Santo Domingo Nuxaá",511]
[null,null,null,null,null,null,null,null,null,"Oaxaca",20,"Santo Domingo Ozolotepec",512]
[null,null,null,null,null,null,null,null,null,"Oaxaca",20,"Santo Domingo Petapa",513]
[null,null,null,null,null,null,null,null,null,"Oaxaca",20,"Santo Domingo Roayaga",514]
[null,null,null,null,null,null,null,null,null,"Oaxaca",20,"Santo Domingo Tehuantepec",515]
[null,null,null,null,null,null,null,null,null,"Oaxaca",20,"Santo Domingo Teojomulco",516]
[null,null,null,null,null,null,null,null,null,"Oaxaca",20,"Santo Domingo Tepuxtepec",517]
[null,null,null,null,null,null,null,null,null,"Oaxaca",20,"Santo Domingo Tlatayápam",518]
[null,null,null,null,null,null,null,null,null,"Oaxaca",20,"Santo Domingo Tomaltepec",519]
[null,null,null,null,null,null,null,null,null,"Oaxaca",20,"Santo Domingo Tonalá",520]
[null,null,null,null,null,null,null,null,null,"Oaxaca",20,"Santo Domingo Tonaltepec",521]
[null,null,null,null,null,null,null,null,null,"Oaxaca",20,"Santo Domingo Xagacía",522]
[null,null,null,null,null,null,null,null,null,"Oaxaca",20,"Santo Domingo Yanhuitlán",523]
[null,null,null,null,null,null,null,null,null,"Oaxaca",20,"Santo Domingo Yodohino",524]
[null,null,null,null,null,null,null,null,null,"Oaxaca",20,"Santo Domingo Zanatepec",525]
[null,null,null,null,null,null,null,null,null,"Oaxaca",20,"Santos Reyes Nopala",526]
[null,null,null,null,null,null,null,null,null,"Oaxaca",20,"Santos Reyes Pápalo",527]
[null,null,null,null,null,null,null,null,null,"Oaxaca",20,"Santos Reyes Tepejillo",528]
[null,null,null,null,null,null,null,null,null,"Oaxaca",20,"Santos Reyes Yucuná",529]
[null,null,null,null,null,null,null,null,null,"Oaxaca",20,"Santo Tomás Jalieza",530]
[null,null,null,null,null,null,null,null,null,"Oaxaca",20,"Santo Tomás Mazaltepec",531]
[null,null,null,null,null,null,null,null,null,"Oaxaca",20,"Santo Tomás Ocotepec",532]
[null,null,null,null,null,null,null,null,null,"Oaxaca",20,"Santo Tomás Tamazulapan",533]
[null,null,null,null,null,null,null,null,null,"Oaxaca",20,"San Vicente Coatlán",534]
[null,null,null,null,null,null,null,null,null,"Oaxaca",20,"San Vicente Lachixío",535]
[null,null,null,null,null,null,null,null,null,"Oaxaca",20,"San Vicente Nuñú",536]
[null,null,null,null,null,null,null,null,null,"Oaxaca",20,"Silacayoápam",537]
[null,null,null,null,null,null,null,null,null,"Oaxaca",20,"Sitio de Xitlapehua",538]
[null,null,null,null,null,null,null,null,null,"Oaxaca",20,"Soledad Etla",539]
[null,null,null,null,null,null,null,null,null,"Oaxaca",20,"Villa de Tamazulápam del Progreso",540]
[null,null,null,null,null,null,null,null,null,"Oaxaca",20,"Tanetze de Zaragoza",541]
[null,null,null,null,null,null,null,null,null,"Oaxaca",20,"Taniche",542]
[null,null,null,null,null,null,null,null,null,"Oaxaca",20,"Tataltepec de Valdés",543]
[null,null,null,null,null,null,null,null,null,"Oaxaca",20,"Teococuilco de Marcos Pérez",544]
[null,null,null,null,null,null,null,null,null,"Oaxaca",20,"Teotitlán de Flores Magón",545]
[null,null,null,null,null,null,null,null,null,"Oaxaca",20,"Teotitlán del Valle",546]
[null,null,null,null,null,null,null,null,null,"Oaxaca",20,"Teotongo",547]
[null,null,null,null,null,null,null,null,null,"Oaxaca",20,"Tepelmeme Villa de Morelos",548]
[null,null,null,null,null,null,null,null,null,"Oaxaca",20,"Heroica Villa Tezoatlán de Segura y Luna, Cuna de la Independencia de Oaxaca",549]
[null,null,null,null,null,null,null,null,null,"Oaxaca",20,"San Jerónimo Tlacochahuaya",550]
[null,null,null,null,null,null,null,null,null,"Oaxaca",20,"Tlacolula de Matamoros",551]
[null,null,null,null,null,null,null,null,null,"Oaxaca",20,"Tlacotepec Plumas",552]
[null,null,null,null,null,null,null,null,null,"Oaxaca",20,"Tlalixtac de Cabrera",553]
[null,null,null,null,null,null,null,null,null,"Oaxaca",20,"Totontepec Villa de Morelos",554]
[null,null,null,null,null,null,null,null,null,"Oaxaca",20,"Trinidad Zaachila",555]
[null,null,null,null,null,null,null,null,null,"Oaxaca",20,"La Trinidad Vista Hermosa",556]
[null,null,null,null,null,null,null,null,null,"Oaxaca",20,"Unión Hidalgo",557]
[null,null,null,null,null,null,null,null,null,"Oaxaca",20,"Valerio Trujano",558]
[null,null,null,null,null,null,null,null,null,"Oaxaca",20,"San Juan Bautista Valle Nacional",559]
[null,null,null,null,null,null,null,null,null,"Oaxaca",20,"Villa Díaz Ordaz",560]
[null,null,null,null,null,null,null,null,null,"Oaxaca",20,"Yaxe",561]
[null,null,null,null,null,null,null,null,null,"Oaxaca",20,"Magdalena Yodocono de Porfirio Díaz",562]
[null,null,null,null,null,null,null,null,null,"Oaxaca",20,"Yogana",563]
[null,null,null,null,null,null,null,null,null,"Oaxaca",20,"Yutanduchi de Guerrero",564]
[null,null,null,null,null,null,null,null,null,"Oaxaca",20,"Villa de Zaachila",565]
[null,null,null,null,null,null,null,null,null,"Oaxaca",20,"San Mateo Yucutindoo",566]
[null,null,null,null,null,null,null,null,null,"Oaxaca",20,"Zapotitlán Lagunas",567]
[null,null,null,null,null,null,null,null,null,"Oaxaca",20,"Zapotitlán Palmas",568]
[null,null,null,null,null,null,null,null,null,"Oaxaca",20,"Santa Inés de Zaragoza",569]
[null,null,null,null,null,null,null,null,null,"Oaxaca",20,"Zimatlán de Álvarez",570]
[null,null,null,null,null,null,null,null,null,"Oaxaca",20,"Sin municipio identificado","999"]
[null,null,null,null,null,null,null,null,null,"Puebla",21,"Acajete","001"]
[null,null,null,null,null,null,null,null,null,"Puebla",21,"Acateno","002"]
[null,null,null,null,null,null,null,null,null,"Puebla",21,"Acatlán","003"]
[null,null,null,null,null,null,null,null,null,"Puebla",21,"Acatzingo","004"]
[null,null,null,null,null,null,null,null,null,"Puebla",21,"Acteopan","005"]
[null,null,null,null,null,null,null,null,null,"Puebla",21,"Ahuacatlán","006"]
[null,null,null,null,null,null,null,null,null,"Puebla",21,"Ahuatlán","007"]
[null,null,null,null,null,null,null,null,null,"Puebla",21,"Ahuazotepec","008"]
[null,null,null,null,null,null,null,null,null,"Puebla",21,"Ahuehuetitla","009"]
[null,null,null,null,null,null,null,null,null,"Puebla",21,"Ajalpan","010"]
[null,null,null,null,null,null,null,null,null,"Puebla",21,"Albino Zertuche","011"]
[null,null,null,null,null,null,null,null,null,"Puebla",21,"Aljojuca","012"]
[null,null,null,null,null,null,null,null,null,"Puebla",21,"Altepexi","013"]
[null,null,null,null,null,null,null,null,null,"Puebla",21,"Amixtlán","014"]
[null,null,null,null,null,null,null,null,null,"Puebla",21,"Amozoc","015"]
[null,null,null,null,null,null,null,null,null,"Puebla",21,"Aquixtla","016"]
[null,null,null,null,null,null,null,null,null,"Puebla",21,"Atempan","017"]
[null,null,null,null,null,null,null,null,null,"Puebla",21,"Atexcal","018"]
[null,null,null,null,null,null,null,null,null,"Puebla",21,"Atlixco","019"]
[null,null,null,null,null,null,null,null,null,"Puebla",21,"Atoyatempan","020"]
[null,null,null,null,null,null,null,null,null,"Puebla",21,"Atzala","021"]
[null,null,null,null,null,null,null,null,null,"Puebla",21,"Atzitzihuacán","022"]
[null,null,null,null,null,null,null,null,null,"Puebla",21,"Atzitzintla","023"]
[null,null,null,null,null,null,null,null,null,"Puebla",21,"Axutla","024"]
[null,null,null,null,null,null,null,null,null,"Puebla",21,"Ayotoxco de Guerrero","025"]
[null,null,null,null,null,null,null,null,null,"Puebla",21,"Calpan","026"]
[null,null,null,null,null,null,null,null,null,"Puebla",21,"Caltepec","027"]
[null,null,null,null,null,null,null,null,null,"Puebla",21,"Camocuautla","028"]
[null,null,null,null,null,null,null,null,null,"Puebla",21,"Caxhuacan","029"]
[null,null,null,null,null,null,null,null,null,"Puebla",21,"Coatepec","030"]
[null,null,null,null,null,null,null,null,null,"Puebla",21,"Coatzingo","031"]
[null,null,null,null,null,null,null,null,null,"Puebla",21,"Cohetzala","032"]
[null,null,null,null,null,null,null,null,null,"Puebla",21,"Cohuecan","033"]
[null,null,null,null,null,null,null,null,null,"Puebla",21,"Coronango","034"]
[null,null,null,null,null,null,null,null,null,"Puebla",21,"Coxcatlán","035"]
[null,null,null,null,null,null,null,null,null,"Puebla",21,"Coyomeapan","036"]
[null,null,null,null,null,null,null,null,null,"Puebla",21,"Coyotepec","037"]
[null,null,null,null,null,null,null,null,null,"Puebla",21,"Cuapiaxtla de Madero","038"]
[null,null,null,null,null,null,null,null,null,"Puebla",21,"Cuautempan","039"]
[null,null,null,null,null,null,null,null,null,"Puebla",21,"Cuautinchán","040"]
[null,null,null,null,null,null,null,null,null,"Puebla",21,"Cuautlancingo","041"]
[null,null,null,null,null,null,null,null,null,"Puebla",21,"Cuayuca de Andrade","042"]
[null,null,null,null,null,null,null,null,null,"Puebla",21,"Cuetzalan del Progreso","043"]
[null,null,null,null,null,null,null,null,null,"Puebla",21,"Cuyoaco","044"]
[null,null,null,null,null,null,null,null,null,"Puebla",21,"Chalchicomula de Sesma","045"]
[null,null,null,null,null,null,null,null,null,"Puebla",21,"Chapulco","046"]
[null,null,null,null,null,null,null,null,null,"Puebla",21,"Chiautla","047"]
[null,null,null,null,null,null,null,null,null,"Puebla",21,"Chiautzingo","048"]
[null,null,null,null,null,null,null,null,null,"Puebla",21,"Chiconcuautla","049"]
[null,null,null,null,null,null,null,null,null,"Puebla",21,"Chichiquila","050"]
[null,null,null,null,null,null,null,null,null,"Puebla",21,"Chietla","051"]
[null,null,null,null,null,null,null,null,null,"Puebla",21,"Chigmecatitlán","052"]
[null,null,null,null,null,null,null,null,null,"Puebla",21,"Chignahuapan","053"]
[null,null,null,null,null,null,null,null,null,"Puebla",21,"Chignautla","054"]
[null,null,null,null,null,null,null,null,null,"Puebla",21,"Chila","055"]
[null,null,null,null,null,null,null,null,null,"Puebla",21,"Chila de la Sal","056"]
[null,null,null,null,null,null,null,null,null,"Puebla",21,"Honey","057"]
[null,null,null,null,null,null,null,null,null,"Puebla",21,"Chilchotla","058"]
[null,null,null,null,null,null,null,null,null,"Puebla",21,"Chinantla","059"]
[null,null,null,null,null,null,null,null,null,"Puebla",21,"Domingo Arenas","060"]
[null,null,null,null,null,null,null,null,null,"Puebla",21,"Eloxochitlán","061"]
[null,null,null,null,null,null,null,null,null,"Puebla",21,"Epatlán","062"]
[null,null,null,null,null,null,null,null,null,"Puebla",21,"Esperanza","063"]
[null,null,null,null,null,null,null,null,null,"Puebla",21,"Francisco Z. Mena","064"]
[null,null,null,null,null,null,null,null,null,"Puebla",21,"General Felipe Ángeles","065"]
[null,null,null,null,null,null,null,null,null,"Puebla",21,"Guadalupe","066"]
[null,null,null,null,null,null,null,null,null,"Puebla",21,"Guadalupe Victoria","067"]
[null,null,null,null,null,null,null,null,null,"Puebla",21,"Hermenegildo Galeana","068"]
[null,null,null,null,null,null,null,null,null,"Puebla",21,"Huaquechula","069"]
[null,null,null,null,null,null,null,null,null,"Puebla",21,"Huatlatlauca","070"]
[null,null,null,null,null,null,null,null,null,"Puebla",21,"Huauchinango","071"]
[null,null,null,null,null,null,null,null,null,"Puebla",21,"Huehuetla","072"]
[null,null,null,null,null,null,null,null,null,"Puebla",21,"Huehuetlán el Chico","073"]
[null,null,null,null,null,null,null,null,null,"Puebla",21,"Huejotzingo","074"]
[null,null,null,null,null,null,null,null,null,"Puebla",21,"Hueyapan","075"]
[null,null,null,null,null,null,null,null,null,"Puebla",21,"Hueytamalco","076"]
[null,null,null,null,null,null,null,null,null,"Puebla",21,"Hueytlalpan","077"]
[null,null,null,null,null,null,null,null,null,"Puebla",21,"Huitzilan de Serdán","078"]
[null,null,null,null,null,null,null,null,null,"Puebla",21,"Huitziltepec","079"]
[null,null,null,null,null,null,null,null,null,"Puebla",21,"Atlequizayan","080"]
[null,null,null,null,null,null,null,null,null,"Puebla",21,"Ixcamilpa de Guerrero","081"]
[null,null,null,null,null,null,null,null,null,"Puebla",21,"Ixcaquixtla","082"]
[null,null,null,null,null,null,null,null,null,"Puebla",21,"Ixtacamaxtitlán","083"]
[null,null,null,null,null,null,null,null,null,"Puebla",21,"Ixtepec","084"]
[null,null,null,null,null,null,null,null,null,"Puebla",21,"Izúcar de Matamoros","085"]
[null,null,null,null,null,null,null,null,null,"Puebla",21,"Jalpan","086"]
[null,null,null,null,null,null,null,null,null,"Puebla",21,"Jolalpan","087"]
[null,null,null,null,null,null,null,null,null,"Puebla",21,"Jonotla","088"]
[null,null,null,null,null,null,null,null,null,"Puebla",21,"Jopala","089"]
[null,null,null,null,null,null,null,null,null,"Puebla",21,"Juan C. Bonilla","090"]
[null,null,null,null,null,null,null,null,null,"Puebla",21,"Juan Galindo","091"]
[null,null,null,null,null,null,null,null,null,"Puebla",21,"Juan N. Méndez","092"]
[null,null,null,null,null,null,null,null,null,"Puebla",21,"Lafragua","093"]
[null,null,null,null,null,null,null,null,null,"Puebla",21,"Libres","094"]
[null,null,null,null,null,null,null,null,null,"Puebla",21,"La Magdalena Tlatlauquitepec","095"]
[null,null,null,null,null,null,null,null,null,"Puebla",21,"Mazapiltepec de Juárez","096"]
[null,null,null,null,null,null,null,null,null,"Puebla",21,"Mixtla","097"]
[null,null,null,null,null,null,null,null,null,"Puebla",21,"Molcaxac","098"]
[null,null,null,null,null,null,null,null,null,"Puebla",21,"Cañada Morelos","099"]
[null,null,null,null,null,null,null,null,null,"Puebla",21,"Naupan",100]
[null,null,null,null,null,null,null,null,null,"Puebla",21,"Nauzontla",101]
[null,null,null,null,null,null,null,null,null,"Puebla",21,"Nealtican",102]
[null,null,null,null,null,null,null,null,null,"Puebla",21,"Nicolás Bravo",103]
[null,null,null,null,null,null,null,null,null,"Puebla",21,"Nopalucan",104]
[null,null,null,null,null,null,null,null,null,"Puebla",21,"Ocotepec",105]
[null,null,null,null,null,null,null,null,null,"Puebla",21,"Ocoyucan",106]
[null,null,null,null,null,null,null,null,null,"Puebla",21,"Olintla",107]
[null,null,null,null,null,null,null,null,null,"Puebla",21,"Oriental",108]
[null,null,null,null,null,null,null,null,null,"Puebla",21,"Pahuatlán",109]
[null,null,null,null,null,null,null,null,null,"Puebla",21,"Palmar de Bravo",110]
[null,null,null,null,null,null,null,null,null,"Puebla",21,"Pantepec",111]
[null,null,null,null,null,null,null,null,null,"Puebla",21,"Petlalcingo",112]
[null,null,null,null,null,null,null,null,null,"Puebla",21,"Piaxtla",113]
[null,null,null,null,null,null,null,null,null,"Puebla",21,"Puebla",114]
[null,null,null,null,null,null,null,null,null,"Puebla",21,"Quecholac",115]
[null,null,null,null,null,null,null,null,null,"Puebla",21,"Quimixtlán",116]
[null,null,null,null,null,null,null,null,null,"Puebla",21,"Rafael Lara Grajales",117]
[null,null,null,null,null,null,null,null,null,"Puebla",21,"Los Reyes de Juárez",118]
[null,null,null,null,null,null,null,null,null,"Puebla",21,"San Andrés Cholula",119]
[null,null,null,null,null,null,null,null,null,"Puebla",21,"San Antonio Cañada",120]
[null,null,null,null,null,null,null,null,null,"Puebla",21,"San Diego la Mesa Tochimiltzingo",121]
[null,null,null,null,null,null,null,null,null,"Puebla",21,"San Felipe Teotlalcingo",122]
[null,null,null,null,null,null,null,null,null,"Puebla",21,"San Felipe Tepatlán",123]
[null,null,null,null,null,null,null,null,null,"Puebla",21,"San Gabriel Chilac",124]
[null,null,null,null,null,null,null,null,null,"Puebla",21,"San Gregorio Atzompa",125]
[null,null,null,null,null,null,null,null,null,"Puebla",21,"San Jerónimo Tecuanipan",126]
[null,null,null,null,null,null,null,null,null,"Puebla",21,"San Jerónimo Xayacatlán",127]
[null,null,null,null,null,null,null,null,null,"Puebla",21,"San José Chiapa",128]
[null,null,null,null,null,null,null,null,null,"Puebla",21,"San José Miahuatlán",129]
[null,null,null,null,null,null,null,null,null,"Puebla",21,"San Juan Atenco",130]
[null,null,null,null,null,null,null,null,null,"Puebla",21,"San Juan Atzompa",131]
[null,null,null,null,null,null,null,null,null,"Puebla",21,"San Martín Texmelucan",132]
[null,null,null,null,null,null,null,null,null,"Puebla",21,"San Martín Totoltepec",133]
[null,null,null,null,null,null,null,null,null,"Puebla",21,"San Matías Tlalancaleca",134]
[null,null,null,null,null,null,null,null,null,"Puebla",21,"San Miguel Ixitlán",135]
[null,null,null,null,null,null,null,null,null,"Puebla",21,"San Miguel Xoxtla",136]
[null,null,null,null,null,null,null,null,null,"Puebla",21,"San Nicolás Buenos Aires",137]
[null,null,null,null,null,null,null,null,null,"Puebla",21,"San Nicolás de los Ranchos",138]
[null,null,null,null,null,null,null,null,null,"Puebla",21,"San Pablo Anicano",139]
[null,null,null,null,null,null,null,null,null,"Puebla",21,"San Pedro Cholula",140]
[null,null,null,null,null,null,null,null,null,"Puebla",21,"San Pedro Yeloixtlahuaca",141]
[null,null,null,null,null,null,null,null,null,"Puebla",21,"San Salvador el Seco",142]
[null,null,null,null,null,null,null,null,null,"Puebla",21,"San Salvador el Verde",143]
[null,null,null,null,null,null,null,null,null,"Puebla",21,"San Salvador Huixcolotla",144]
[null,null,null,null,null,null,null,null,null,"Puebla",21,"San Sebastián Tlacotepec",145]
[null,null,null,null,null,null,null,null,null,"Puebla",21,"Santa Catarina Tlaltempan",146]
[null,null,null,null,null,null,null,null,null,"Puebla",21,"Santa Inés Ahuatempan",147]
[null,null,null,null,null,null,null,null,null,"Puebla",21,"Santa Isabel Cholula",148]
[null,null,null,null,null,null,null,null,null,"Puebla",21,"Santiago Miahuatlán",149]
[null,null,null,null,null,null,null,null,null,"Puebla",21,"Huehuetlán el Grande",150]
[null,null,null,null,null,null,null,null,null,"Puebla",21,"Santo Tomás Hueyotlipan",151]
[null,null,null,null,null,null,null,null,null,"Puebla",21,"Soltepec",152]
[null,null,null,null,null,null,null,null,null,"Puebla",21,"Tecali de Herrera",153]
[null,null,null,null,null,null,null,null,null,"Puebla",21,"Tecamachalco",154]
[null,null,null,null,null,null,null,null,null,"Puebla",21,"Tecomatlán",155]
[null,null,null,null,null,null,null,null,null,"Puebla",21,"Tehuacán",156]
[null,null,null,null,null,null,null,null,null,"Puebla",21,"Tehuitzingo",157]
[null,null,null,null,null,null,null,null,null,"Puebla",21,"Tenampulco",158]
[null,null,null,null,null,null,null,null,null,"Puebla",21,"Teopantlán",159]
[null,null,null,null,null,null,null,null,null,"Puebla",21,"Teotlalco",160]
[null,null,null,null,null,null,null,null,null,"Puebla",21,"Tepanco de López",161]
[null,null,null,null,null,null,null,null,null,"Puebla",21,"Tepango de Rodríguez",162]
[null,null,null,null,null,null,null,null,null,"Puebla",21,"Tepatlaxco de Hidalgo",163]
[null,null,null,null,null,null,null,null,null,"Puebla",21,"Tepeaca",164]
[null,null,null,null,null,null,null,null,null,"Puebla",21,"Tepemaxalco",165]
[null,null,null,null,null,null,null,null,null,"Puebla",21,"Tepeojuma",166]
[null,null,null,null,null,null,null,null,null,"Puebla",21,"Tepetzintla",167]
[null,null,null,null,null,null,null,null,null,"Puebla",21,"Tepexco",168]
[null,null,null,null,null,null,null,null,null,"Puebla",21,"Tepexi de Rodríguez",169]
[null,null,null,null,null,null,null,null,null,"Puebla",21,"Tepeyahualco",170]
[null,null,null,null,null,null,null,null,null,"Puebla",21,"Tepeyahualco de Cuauhtémoc",171]
[null,null,null,null,null,null,null,null,null,"Puebla",21,"Tetela de Ocampo",172]
[null,null,null,null,null,null,null,null,null,"Puebla",21,"Teteles de Ávila Castillo",173]
[null,null,null,null,null,null,null,null,null,"Puebla",21,"Teziutlán",174]
[null,null,null,null,null,null,null,null,null,"Puebla",21,"Tianguismanalco",175]
[null,null,null,null,null,null,null,null,null,"Puebla",21,"Tilapa",176]
[null,null,null,null,null,null,null,null,null,"Puebla",21,"Tlacotepec de Benito Juárez",177]
[null,null,null,null,null,null,null,null,null,"Puebla",21,"Tlacuilotepec",178]
[null,null,null,null,null,null,null,null,null,"Puebla",21,"Tlachichuca",179]
[null,null,null,null,null,null,null,null,null,"Puebla",21,"Tlahuapan",180]
[null,null,null,null,null,null,null,null,null,"Puebla",21,"Tlaltenango",181]
[null,null,null,null,null,null,null,null,null,"Puebla",21,"Tlanepantla",182]
[null,null,null,null,null,null,null,null,null,"Puebla",21,"Tlaola",183]
[null,null,null,null,null,null,null,null,null,"Puebla",21,"Tlapacoya",184]
[null,null,null,null,null,null,null,null,null,"Puebla",21,"Tlapanalá",185]
[null,null,null,null,null,null,null,null,null,"Puebla",21,"Tlatlauquitepec",186]
[null,null,null,null,null,null,null,null,null,"Puebla",21,"Tlaxco",187]
[null,null,null,null,null,null,null,null,null,"Puebla",21,"Tochimilco",188]
[null,null,null,null,null,null,null,null,null,"Puebla",21,"Tochtepec",189]
[null,null,null,null,null,null,null,null,null,"Puebla",21,"Totoltepec de Guerrero",190]
[null,null,null,null,null,null,null,null,null,"Puebla",21,"Tulcingo",191]
[null,null,null,null,null,null,null,null,null,"Puebla",21,"Tuzamapan de Galeana",192]
[null,null,null,null,null,null,null,null,null,"Puebla",21,"Tzicatlacoyan",193]
[null,null,null,null,null,null,null,null,null,"Puebla",21,"Venustiano Carranza",194]
[null,null,null,null,null,null,null,null,null,"Puebla",21,"Vicente Guerrero",195]
[null,null,null,null,null,null,null,null,null,"Puebla",21,"Xayacatlán de Bravo",196]
[null,null,null,null,null,null,null,null,null,"Puebla",21,"Xicotepec",197]
[null,null,null,null,null,null,null,null,null,"Puebla",21,"Xicotlán",198]
[null,null,null,null,null,null,null,null,null,"Puebla",21,"Xiutetelco",199]
[null,null,null,null,null,null,null,null,null,"Puebla",21,"Xochiapulco",200]
[null,null,null,null,null,null,null,null,null,"Puebla",21,"Xochiltepec",201]
[null,null,null,null,null,null,null,null,null,"Puebla",21,"Xochitlán de Vicente Suárez",202]
[null,null,null,null,null,null,null,null,null,"Puebla",21,"Xochitlán Todos Santos",203]
[null,null,null,null,null,null,null,null,null,"Puebla",21,"Yaonáhuac",204]
[null,null,null,null,null,null,null,null,null,"Puebla",21,"Yehualtepec",205]
[null,null,null,null,null,null,null,null,null,"Puebla",21,"Zacapala",206]
[null,null,null,null,null,null,null,null,null,"Puebla",21,"Zacapoaxtla",207]
[null,null,null,null,null,null,null,null,null,"Puebla",21,"Zacatlán",208]
[null,null,null,null,null,null,null,null,null,"Puebla",21,"Zapotitlán",209]
[null,null,null,null,null,null,null,null,null,"Puebla",21,"Zapotitlán de Méndez",210]
[null,null,null,null,null,null,null,null,null,"Puebla",21,"Zaragoza",211]
[null,null,null,null,null,null,null,null,null,"Puebla",21,"Zautla",212]
[null,null,null,null,null,null,null,null,null,"Puebla",21,"Zihuateutla",213]
[null,null,null,null,null,null,null,null,null,"Puebla",21,"Zinacatepec",214]
[null,null,null,null,null,null,null,null,null,"Puebla",21,"Zongozotla",215]
[null,null,null,null,null,null,null,null,null,"Puebla",21,"Zoquiapan",216]
[null,null,null,null,null,null,null,null,null,"Puebla",21,"Zoquitlán",217]
[null,null,null,null,null,null,null,null,null,"Puebla",21,"Sin municipio identificado","999"]
[null,null,null,null,null,null,null,null,null,"Querétaro",22,"Amealco de Bonfil","001"]
[null,null,null,null,null,null,null,null,null,"Querétaro",22,"Pinal de Amoles","002"]
[null,null,null,null,null,null,null,null,null,"Querétaro",22,"Arroyo Seco","003"]
[null,null,null,null,null,null,null,null,null,"Querétaro",22,"Cadereyta de Montes","004"]
[null,null,null,null,null,null,null,null,null,"Querétaro",22,"Colón","005"]
[null,null,null,null,null,null,null,null,null,"Querétaro",22,"Corregidora","006"]
[null,null,null,null,null,null,null,null,null,"Querétaro",22,"Ezequiel Montes","007"]
[null,null,null,null,null,null,null,null,null,"Querétaro",22,"Huimilpan","008"]
[null,null,null,null,null,null,null,null,null,"Querétaro",22,"Jalpan de Serra","009"]
[null,null,null,null,null,null,null,null,null,"Querétaro",22,"Landa de Matamoros","010"]
[null,null,null,null,null,null,null,null,null,"Querétaro",22,"El Marqués","011"]
[null,null,null,null,null,null,null,null,null,"Querétaro",22,"Pedro Escobedo","012"]
[null,null,null,null,null,null,null,null,null,"Querétaro",22,"Peñamiller","013"]
[null,null,null,null,null,null,null,null,null,"Querétaro",22,"Querétaro","014"]
[null,null,null,null,null,null,null,null,null,"Querétaro",22,"San Joaquín","015"]
[null,null,null,null,null,null,null,null,null,"Querétaro",22,"San Juan del Río","016"]
[null,null,null,null,null,null,null,null,null,"Querétaro",22,"Tequisquiapan","017"]
[null,null,null,null,null,null,null,null,null,"Querétaro",22,"Tolimán","018"]
[null,null,null,null,null,null,null,null,null,"Querétaro",22,"Sin municipio identificado","999"]
[null,null,null,null,null,null,null,null,null,"Quintana Roo",23,"Cozumel","001"]
[null,null,null,null,null,null,null,null,null,"Quintana Roo",23,"Felipe Carrillo Puerto","002"]
[null,null,null,null,null,null,null,null,null,"Quintana Roo",23,"Isla Mujeres","003"]
[null,null,null,null,null,null,null,null,null,"Quintana Roo",23,"Othón P. Blanco","004"]
[null,null,null,null,null,null,null,null,null,"Quintana Roo",23,"Benito Juárez","005"]
[null,null,null,null,null,null,null,null,null,"Quintana Roo",23,"José María Morelos","006"]
[null,null,null,null,null,null,null,null,null,"Quintana Roo",23,"Lázaro Cárdenas","007"]
[null,null,null,null,null,null,null,null,null,"Quintana Roo",23,"Playa del Carmen","008"]
[null,null,null,null,null,null,null,null,null,"Quintana Roo",23,"Tulum","009"]
[null,null,null,null,null,null,null,null,null,"Quintana Roo",23,"Bacalar","010"]
[null,null,null,null,null,null,null,null,null,"Quintana Roo",23,"Puerto Morelos","011"]
[null,null,null,null,null,null,null,null,null,"Quintana Roo",23,"Sin municipio identificado","999"]
[null,null,null,null,null,null,null,null,null,"San Luis Potosí",24,"Ahualulco del Sonido 13","001"]
[null,null,null,null,null,null,null,null,null,"San Luis Potosí",24,"Alaquines","002"]
[null,null,null,null,null,null,null,null,null,"San Luis Potosí",24,"Aquismón","003"]
[null,null,null,null,null,null,null,null,null,"San Luis Potosí",24,"Armadillo de los Infante","004"]
[null,null,null,null,null,null,null,null,null,"San Luis Potosí",24,"Cárdenas","005"]
[null,null,null,null,null,null,null,null,null,"San Luis Potosí",24,"Catorce","006"]
[null,null,null,null,null,null,null,null,null,"San Luis Potosí",24,"Cedral","007"]
[null,null,null,null,null,null,null,null,null,"San Luis Potosí",24,"Cerritos","008"]
[null,null,null,null,null,null,null,null,null,"San Luis Potosí",24,"Cerro de San Pedro","009"]
[null,null,null,null,null,null,null,null,null,"San Luis Potosí",24,"Ciudad del Maíz","010"]
[null,null,null,null,null,null,null,null,null,"San Luis Potosí",24,"Ciudad Fernández","011"]
[null,null,null,null,null,null,null,null,null,"San Luis Potosí",24,"Tancanhuitz","012"]
[null,null,null,null,null,null,null,null,null,"San Luis Potosí",24,"Ciudad Valles","013"]
[null,null,null,null,null,null,null,null,null,"San Luis Potosí",24,"Coxcatlán","014"]
[null,null,null,null,null,null,null,null,null,"San Luis Potosí",24,"Charcas","015"]
[null,null,null,null,null,null,null,null,null,"San Luis Potosí",24,"Ebano","016"]
[null,null,null,null,null,null,null,null,null,"San Luis Potosí",24,"Guadalcázar","017"]
[null,null,null,null,null,null,null,null,null,"San Luis Potosí",24,"Huehuetlán","018"]
[null,null,null,null,null,null,null,null,null,"San Luis Potosí",24,"Lagunillas","019"]
[null,null,null,null,null,null,null,null,null,"San Luis Potosí",24,"Matehuala","020"]
[null,null,null,null,null,null,null,null,null,"San Luis Potosí",24,"Mexquitic de Carmona","021"]
[null,null,null,null,null,null,null,null,null,"San Luis Potosí",24,"Moctezuma","022"]
[null,null,null,null,null,null,null,null,null,"San Luis Potosí",24,"Rayón","023"]
[null,null,null,null,null,null,null,null,null,"San Luis Potosí",24,"Rioverde","024"]
[null,null,null,null,null,null,null,null,null,"San Luis Potosí",24,"Salinas","025"]
[null,null,null,null,null,null,null,null,null,"San Luis Potosí",24,"San Antonio","026"]
[null,null,null,null,null,null,null,null,null,"San Luis Potosí",24,"San Ciro de Acosta","027"]
[null,null,null,null,null,null,null,null,null,"San Luis Potosí",24,"San Luis Potosí","028"]
[null,null,null,null,null,null,null,null,null,"San Luis Potosí",24,"San Martín Chalchicuautla","029"]
[null,null,null,null,null,null,null,null,null,"San Luis Potosí",24,"San Nicolás Tolentino","030"]
[null,null,null,null,null,null,null,null,null,"San Luis Potosí",24,"Santa Catarina","031"]
[null,null,null,null,null,null,null,null,null,"San Luis Potosí",24,"Santa María del Río","032"]
[null,null,null,null,null,null,null,null,null,"San Luis Potosí",24,"Santo Domingo","033"]
[null,null,null,null,null,null,null,null,null,"San Luis Potosí",24,"San Vicente Tancuayalab","034"]
[null,null,null,null,null,null,null,null,null,"San Luis Potosí",24,"Soledad de Graciano Sánchez","035"]
[null,null,null,null,null,null,null,null,null,"San Luis Potosí",24,"Tamasopo","036"]
[null,null,null,null,null,null,null,null,null,"San Luis Potosí",24,"Tamazunchale","037"]
[null,null,null,null,null,null,null,null,null,"San Luis Potosí",24,"Tampacán","038"]
[null,null,null,null,null,null,null,null,null,"San Luis Potosí",24,"Tampamolón Corona","039"]
[null,null,null,null,null,null,null,null,null,"San Luis Potosí",24,"Tamuín","040"]
[null,null,null,null,null,null,null,null,null,"San Luis Potosí",24,"Tanlajás","041"]
[null,null,null,null,null,null,null,null,null,"San Luis Potosí",24,"Tanquián de Escobedo","042"]
[null,null,null,null,null,null,null,null,null,"San Luis Potosí",24,"Tierra Nueva","043"]
[null,null,null,null,null,null,null,null,null,"San Luis Potosí",24,"Vanegas","044"]
[null,null,null,null,null,null,null,null,null,"San Luis Potosí",24,"Venado","045"]
[null,null,null,null,null,null,null,null,null,"San Luis Potosí",24,"Villa de Arriaga","046"]
[null,null,null,null,null,null,null,null,null,"San Luis Potosí",24,"Villa de Guadalupe","047"]
[null,null,null,null,null,null,null,null,null,"San Luis Potosí",24,"Villa de la Paz","048"]
[null,null,null,null,null,null,null,null,null,"San Luis Potosí",24,"Villa de Ramos","049"]
[null,null,null,null,null,null,null,null,null,"San Luis Potosí",24,"Villa de Reyes","050"]
[null,null,null,null,null,null,null,null,null,"San Luis Potosí",24,"Villa Hidalgo","051"]
[null,null,null,null,null,null,null,null,null,"San Luis Potosí",24,"Villa Juárez","052"]
[null,null,null,null,null,null,null,null,null,"San Luis Potosí",24,"Axtla de Terrazas","053"]
[null,null,null,null,null,null,null,null,null,"San Luis Potosí",24,"Xilitla","054"]
[null,null,null,null,null,null,null,null,null,"San Luis Potosí",24,"Zaragoza","055"]
[null,null,null,null,null,null,null,null,null,"San Luis Potosí",24,"Villa de Arista","056"]
[null,null,null,null,null,null,null,null,null,"San Luis Potosí",24,"Matlapa","057"]
[null,null,null,null,null,null,null,null,null,"San Luis Potosí",24,"El Naranjo","058"]
[null,null,null,null,null,null,null,null,null,"San Luis Potosí",24,"Villa de Pozos","059"]
[null,null,null,null,null,null,null,null,null,"San Luis Potosí",24,"Sin municipio identificado","999"]
[null,null,null,null,null,null,null,null,null,"Sinaloa",25,"Ahome","001"]
[null,null,null,null,null,null,null,null,null,"Sinaloa",25,"Angostura","002"]
[null,null,null,null,null,null,null,null,null,"Sinaloa",25,"Badiraguato","003"]
[null,null,null,null,null,null,null,null,null,"Sinaloa",25,"Concordia","004"]
[null,null,null,null,null,null,null,null,null,"Sinaloa",25,"Cosalá","005"]
[null,null,null,null,null,null,null,null,null,"Sinaloa",25,"Culiacán","006"]
[null,null,null,null,null,null,null,null,null,"Sinaloa",25,"Choix","007"]
[null,null,null,null,null,null,null,null,null,"Sinaloa",25,"Elota","008"]
[null,null,null,null,null,null,null,null,null,"Sinaloa",25,"Escuinapa","009"]
[null,null,null,null,null,null,null,null,null,"Sinaloa",25,"El Fuerte","010"]
[null,null,null,null,null,null,null,null,null,"Sinaloa",25,"Guasave","011"]
[null,null,null,null,null,null,null,null,null,"Sinaloa",25,"Mazatlán","012"]
[null,null,null,null,null,null,null,null,null,"Sinaloa",25,"Mocorito","013"]
[null,null,null,null,null,null,null,null,null,"Sinaloa",25,"Rosario","014"]
[null,null,null,null,null,null,null,null,null,"Sinaloa",25,"Salvador Alvarado","015"]
[null,null,null,null,null,null,null,null,null,"Sinaloa",25,"San Ignacio","016"]
[null,null,null,null,null,null,null,null,null,"Sinaloa",25,"Sinaloa","017"]
[null,null,null,null,null,null,null,null,null,"Sinaloa",25,"Navolato","018"]
[null,null,null,null,null,null,null,null,null,"Sinaloa",25,"Eldorado","019"]
[null,null,null,null,null,null,null,null,null,"Sinaloa",25,"Juan José Ríos","020"]
[null,null,null,null,null,null,null,null,null,"Sinaloa",25,"Sin municipio identificado","999"]
[null,null,null,null,null,null,null,null,null,"Sonora",26,"Aconchi","001"]
[null,null,null,null,null,null,null,null,null,"Sonora",26,"Agua Prieta","002"]
[null,null,null,null,null,null,null,null,null,"Sonora",26,"Álamos","003"]
[null,null,null,null,null,null,null,null,null,"Sonora",26,"Altar","004"]
[null,null,null,null,null,null,null,null,null,"Sonora",26,"Arivechi","005"]
[null,null,null,null,null,null,null,null,null,"Sonora",26,"Arizpe","006"]
[null,null,null,null,null,null,null,null,null,"Sonora",26,"Atil","007"]
[null,null,null,null,null,null,null,null,null,"Sonora",26,"Bacadéhuachi","008"]
[null,null,null,null,null,null,null,null,null,"Sonora",26,"Bacanora","009"]
[null,null,null,null,null,null,null,null,null,"Sonora",26,"Bacerac","010"]
[null,null,null,null,null,null,null,null,null,"Sonora",26,"Bacoachi","011"]
[null,null,null,null,null,null,null,null,null,"Sonora",26,"Bácum","012"]
[null,null,null,null,null,null,null,null,null,"Sonora",26,"Banámichi","013"]
[null,null,null,null,null,null,null,null,null,"Sonora",26,"Baviácora","014"]
[null,null,null,null,null,null,null,null,null,"Sonora",26,"Bavispe","015"]
[null,null,null,null,null,null,null,null,null,"Sonora",26,"Benjamín Hill","016"]
[null,null,null,null,null,null,null,null,null,"Sonora",26,"Caborca","017"]
[null,null,null,null,null,null,null,null,null,"Sonora",26,"Cajeme","018"]
[null,null,null,null,null,null,null,null,null,"Sonora",26,"Cananea","019"]
[null,null,null,null,null,null,null,null,null,"Sonora",26,"Carbó","020"]
[null,null,null,null,null,null,null,null,null,"Sonora",26,"La Colorada","021"]
[null,null,null,null,null,null,null,null,null,"Sonora",26,"Cucurpe","022"]
[null,null,null,null,null,null,null,null,null,"Sonora",26,"Cumpas","023"]
[null,null,null,null,null,null,null,null,null,"Sonora",26,"Divisaderos","024"]
[null,null,null,null,null,null,null,null,null,"Sonora",26,"Empalme","025"]
[null,null,null,null,null,null,null,null,null,"Sonora",26,"Etchojoa","026"]
[null,null,null,null,null,null,null,null,null,"Sonora",26,"Fronteras","027"]
[null,null,null,null,null,null,null,null,null,"Sonora",26,"Granados","028"]
[null,null,null,null,null,null,null,null,null,"Sonora",26,"Guaymas","029"]
[null,null,null,null,null,null,null,null,null,"Sonora",26,"Hermosillo","030"]
[null,null,null,null,null,null,null,null,null,"Sonora",26,"Huachinera","031"]
[null,null,null,null,null,null,null,null,null,"Sonora",26,"Huásabas","032"]
[null,null,null,null,null,null,null,null,null,"Sonora",26,"Huatabampo","033"]
[null,null,null,null,null,null,null,null,null,"Sonora",26,"Huépac","034"]
[null,null,null,null,null,null,null,null,null,"Sonora",26,"Imuris","035"]
[null,null,null,null,null,null,null,null,null,"Sonora",26,"Magdalena","036"]
[null,null,null,null,null,null,null,null,null,"Sonora",26,"Mazatán","037"]
[null,null,null,null,null,null,null,null,null,"Sonora",26,"Moctezuma","038"]
[null,null,null,null,null,null,null,null,null,"Sonora",26,"Naco","039"]
[null,null,null,null,null,null,null,null,null,"Sonora",26,"Nácori Chico","040"]
[null,null,null,null,null,null,null,null,null,"Sonora",26,"Nacozari de García","041"]
[null,null,null,null,null,null,null,null,null,"Sonora",26,"Navojoa","042"]
[null,null,null,null,null,null,null,null,null,"Sonora",26,"Nogales","043"]
[null,null,null,null,null,null,null,null,null,"Sonora",26,"Ónavas","044"]
[null,null,null,null,null,null,null,null,null,"Sonora",26,"Opodepe","045"]
[null,null,null,null,null,null,null,null,null,"Sonora",26,"Oquitoa","046"]
[null,null,null,null,null,null,null,null,null,"Sonora",26,"Pitiquito","047"]
[null,null,null,null,null,null,null,null,null,"Sonora",26,"Puerto Peñasco","048"]
[null,null,null,null,null,null,null,null,null,"Sonora",26,"Quiriego","049"]
[null,null,null,null,null,null,null,null,null,"Sonora",26,"Rayón","050"]
[null,null,null,null,null,null,null,null,null,"Sonora",26,"Rosario","051"]
[null,null,null,null,null,null,null,null,null,"Sonora",26,"Sahuaripa","052"]
[null,null,null,null,null,null,null,null,null,"Sonora",26,"San Felipe de Jesús","053"]
[null,null,null,null,null,null,null,null,null,"Sonora",26,"San Javier","054"]
[null,null,null,null,null,null,null,null,null,"Sonora",26,"San Luis Río Colorado","055"]
[null,null,null,null,null,null,null,null,null,"Sonora",26,"San Miguel de Horcasitas","056"]
[null,null,null,null,null,null,null,null,null,"Sonora",26,"San Pedro de la Cueva","057"]
[null,null,null,null,null,null,null,null,null,"Sonora",26,"Santa Ana","058"]
[null,null,null,null,null,null,null,null,null,"Sonora",26,"Santa Cruz","059"]
[null,null,null,null,null,null,null,null,null,"Sonora",26,"Sáric","060"]
[null,null,null,null,null,null,null,null,null,"Sonora",26,"Soyopa","061"]
[null,null,null,null,null,null,null,null,null,"Sonora",26,"Suaqui Grande","062"]
[null,null,null,null,null,null,null,null,null,"Sonora",26,"Tepache","063"]
[null,null,null,null,null,null,null,null,null,"Sonora",26,"Trincheras","064"]
[null,null,null,null,null,null,null,null,null,"Sonora",26,"Tubutama","065"]
[null,null,null,null,null,null,null,null,null,"Sonora",26,"Ures","066"]
[null,null,null,null,null,null,null,null,null,"Sonora",26,"Villa Hidalgo","067"]
[null,null,null,null,null,null,null,null,null,"Sonora",26,"Villa Pesqueira","068"]
[null,null,null,null,null,null,null,null,null,"Sonora",26,"Yécora","069"]
[null,null,null,null,null,null,null,null,null,"Sonora",26,"General Plutarco Elías Calles","070"]
[null,null,null,null,null,null,null,null,null,"Sonora",26,"Benito Juárez","071"]
[null,null,null,null,null,null,null,null,null,"Sonora",26,"San Ignacio Río Muerto","072"]
[null,null,null,null,null,null,null,null,null,"Sonora",26,"Sin municipio identificado","999"]
[null,null,null,null,null,null,null,null,null,"Tabasco",27,"Balancán","001"]
[null,null,null,null,null,null,null,null,null,"Tabasco",27,"Cárdenas","002"]
[null,null,null,null,null,null,null,null,null,"Tabasco",27,"Centla","003"]
[null,null,null,null,null,null,null,null,null,"Tabasco",27,"Centro","004"]
[null,null,null,null,null,null,null,null,null,"Tabasco",27,"Comalcalco","005"]
[null,null,null,null,null,null,null,null,null,"Tabasco",27,"Cunduacán","006"]
[null,null,null,null,null,null,null,null,null,"Tabasco",27,"Emiliano Zapata","007"]
[null,null,null,null,null,null,null,null,null,"Tabasco",27,"Huimanguillo","008"]
[null,null,null,null,null,null,null,null,null,"Tabasco",27,"Jalapa","009"]
[null,null,null,null,null,null,null,null,null,"Tabasco",27,"Jalpa de Méndez","010"]
[null,null,null,null,null,null,null,null,null,"Tabasco",27,"Jonuta","011"]
[null,null,null,null,null,null,null,null,null,"Tabasco",27,"Macuspana","012"]
[null,null,null,null,null,null,null,null,null,"Tabasco",27,"Nacajuca","013"]
[null,null,null,null,null,null,null,null,null,"Tabasco",27,"Paraíso","014"]
[null,null,null,null,null,null,null,null,null,"Tabasco",27,"Tacotalpa","015"]
[null,null,null,null,null,null,null,null,null,"Tabasco",27,"Teapa","016"]
[null,null,null,null,null,null,null,null,null,"Tabasco",27,"Tenosique","017"]
[null,null,null,null,null,null,null,null,null,"Tabasco",27,"Sin municipio identificado","999"]
[null,null,null,null,null,null,null,null,null,"Tamaulipas",28,"Abasolo","001"]
[null,null,null,null,null,null,null,null,null,"Tamaulipas",28,"Aldama","002"]
[null,null,null,null,null,null,null,null,null,"Tamaulipas",28,"Altamira","003"]
[null,null,null,null,null,null,null,null,null,"Tamaulipas",28,"Antiguo Morelos","004"]
[null,null,null,null,null,null,null,null,null,"Tamaulipas",28,"Burgos","005"]
[null,null,null,null,null,null,null,null,null,"Tamaulipas",28,"Bustamante","006"]
[null,null,null,null,null,null,null,null,null,"Tamaulipas",28,"Camargo","007"]
[null,null,null,null,null,null,null,null,null,"Tamaulipas",28,"Casas","008"]
[null,null,null,null,null,null,null,null,null,"Tamaulipas",28,"Ciudad Madero","009"]
[null,null,null,null,null,null,null,null,null,"Tamaulipas",28,"Cruillas","010"]
[null,null,null,null,null,null,null,null,null,"Tamaulipas",28,"Gómez Farías","011"]
[null,null,null,null,null,null,null,null,null,"Tamaulipas",28,"González","012"]
[null,null,null,null,null,null,null,null,null,"Tamaulipas",28,"Güémez","013"]
[null,null,null,null,null,null,null,null,null,"Tamaulipas",28,"Guerrero","014"]
[null,null,null,null,null,null,null,null,null,"Tamaulipas",28,"Gustavo Díaz Ordaz","015"]
[null,null,null,null,null,null,null,null,null,"Tamaulipas",28,"Hidalgo","016"]
[null,null,null,null,null,null,null,null,null,"Tamaulipas",28,"Jaumave","017"]
[null,null,null,null,null,null,null,null,null,"Tamaulipas",28,"Jiménez","018"]
[null,null,null,null,null,null,null,null,null,"Tamaulipas",28,"Llera","019"]
[null,null,null,null,null,null,null,null,null,"Tamaulipas",28,"Mainero","020"]
[null,null,null,null,null,null,null,null,null,"Tamaulipas",28,"El Mante","021"]
[null,null,null,null,null,null,null,null,null,"Tamaulipas",28,"Matamoros","022"]
[null,null,null,null,null,null,null,null,null,"Tamaulipas",28,"Méndez","023"]
[null,null,null,null,null,null,null,null,null,"Tamaulipas",28,"Mier","024"]
[null,null,null,null,null,null,null,null,null,"Tamaulipas",28,"Miguel Alemán","025"]
[null,null,null,null,null,null,null,null,null,"Tamaulipas",28,"Miquihuana","026"]
[null,null,null,null,null,null,null,null,null,"Tamaulipas",28,"Nuevo Laredo","027"]
[null,null,null,null,null,null,null,null,null,"Tamaulipas",28,"Nuevo Morelos","028"]
[null,null,null,null,null,null,null,null,null,"Tamaulipas",28,"Ocampo","029"]
[null,null,null,null,null,null,null,null,null,"Tamaulipas",28,"Padilla","030"]
[null,null,null,null,null,null,null,null,null,"Tamaulipas",28,"Palmillas","031"]
[null,null,null,null,null,null,null,null,null,"Tamaulipas",28,"Reynosa","032"]
[null,null,null,null,null,null,null,null,null,"Tamaulipas",28,"Río Bravo","033"]
[null,null,null,null,null,null,null,null,null,"Tamaulipas",28,"San Carlos","034"]
[null,null,null,null,null,null,null,null,null,"Tamaulipas",28,"San Fernando","035"]
[null,null,null,null,null,null,null,null,null,"Tamaulipas",28,"San Nicolás","036"]
[null,null,null,null,null,null,null,null,null,"Tamaulipas",28,"Soto la Marina","037"]
[null,null,null,null,null,null,null,null,null,"Tamaulipas",28,"Tampico","038"]
[null,null,null,null,null,null,null,null,null,"Tamaulipas",28,"Tula","039"]
[null,null,null,null,null,null,null,null,null,"Tamaulipas",28,"Valle Hermoso","040"]
[null,null,null,null,null,null,null,null,null,"Tamaulipas",28,"Victoria","041"]
[null,null,null,null,null,null,null,null,null,"Tamaulipas",28,"Villagrán","042"]
[null,null,null,null,null,null,null,null,null,"Tamaulipas",28,"Xicoténcatl","043"]
[null,null,null,null,null,null,null,null,null,"Tamaulipas",28,"Sin municipio identificado","999"]
[null,null,null,null,null,null,null,null,null,"Tlaxcala",29,"Amaxac de Guerrero","001"]
[null,null,null,null,null,null,null,null,null,"Tlaxcala",29,"Apetatitlán de Antonio Carvajal","002"]
[null,null,null,null,null,null,null,null,null,"Tlaxcala",29,"Atlangatepec","003"]
[null,null,null,null,null,null,null,null,null,"Tlaxcala",29,"Atltzayanca","004"]
[null,null,null,null,null,null,null,null,null,"Tlaxcala",29,"Apizaco","005"]
[null,null,null,null,null,null,null,null,null,"Tlaxcala",29,"Calpulalpan","006"]
[null,null,null,null,null,null,null,null,null,"Tlaxcala",29,"El Carmen Tequexquitla","007"]
[null,null,null,null,null,null,null,null,null,"Tlaxcala",29,"Cuapiaxtla","008"]
[null,null,null,null,null,null,null,null,null,"Tlaxcala",29,"Cuaxomulco","009"]
[null,null,null,null,null,null,null,null,null,"Tlaxcala",29,"Chiautempan","010"]
[null,null,null,null,null,null,null,null,null,"Tlaxcala",29,"Muñoz de Domingo Arenas","011"]
[null,null,null,null,null,null,null,null,null,"Tlaxcala",29,"Españita","012"]
[null,null,null,null,null,null,null,null,null,"Tlaxcala",29,"Huamantla","013"]
[null,null,null,null,null,null,null,null,null,"Tlaxcala",29,"Hueyotlipan","014"]
[null,null,null,null,null,null,null,null,null,"Tlaxcala",29,"Ixtacuixtla de Mariano Matamoros","015"]
[null,null,null,null,null,null,null,null,null,"Tlaxcala",29,"Ixtenco","016"]
[null,null,null,null,null,null,null,null,null,"Tlaxcala",29,"Mazatecochco de José María Morelos","017"]
[null,null,null,null,null,null,null,null,null,"Tlaxcala",29,"Contla de Juan Cuamatzi","018"]
[null,null,null,null,null,null,null,null,null,"Tlaxcala",29,"Tepetitla de Lardizábal","019"]
[null,null,null,null,null,null,null,null,null,"Tlaxcala",29,"Sanctórum de Lázaro Cárdenas","020"]
[null,null,null,null,null,null,null,null,null,"Tlaxcala",29,"Nanacamilpa de Mariano Arista","021"]
[null,null,null,null,null,null,null,null,null,"Tlaxcala",29,"Acuamanala de Miguel Hidalgo","022"]
[null,null,null,null,null,null,null,null,null,"Tlaxcala",29,"Natívitas","023"]
[null,null,null,null,null,null,null,null,null,"Tlaxcala",29,"Panotla","024"]
[null,null,null,null,null,null,null,null,null,"Tlaxcala",29,"San Pablo del Monte","025"]
[null,null,null,null,null,null,null,null,null,"Tlaxcala",29,"Santa Cruz Tlaxcala","026"]
[null,null,null,null,null,null,null,null,null,"Tlaxcala",29,"Tenancingo","027"]
[null,null,null,null,null,null,null,null,null,"Tlaxcala",29,"Teolocholco","028"]
[null,null,null,null,null,null,null,null,null,"Tlaxcala",29,"Tepeyanco","029"]
[null,null,null,null,null,null,null,null,null,"Tlaxcala",29,"Terrenate","030"]
[null,null,null,null,null,null,null,null,null,"Tlaxcala",29,"Tetla de la Solidaridad","031"]
[null,null,null,null,null,null,null,null,null,"Tlaxcala",29,"Tetlatlahuca","032"]
[null,null,null,null,null,null,null,null,null,"Tlaxcala",29,"Tlaxcala","033"]
[null,null,null,null,null,null,null,null,null,"Tlaxcala",29,"Tlaxco","034"]
[null,null,null,null,null,null,null,null,null,"Tlaxcala",29,"Tocatlán","035"]
[null,null,null,null,null,null,null,null,null,"Tlaxcala",29,"Totolac","036"]
[null,null,null,null,null,null,null,null,null,"Tlaxcala",29,"Ziltlaltépec de Trinidad Sánchez Santos","037"]
[null,null,null,null,null,null,null,null,null,"Tlaxcala",29,"Tzompantepec","038"]
[null,null,null,null,null,null,null,null,null,"Tlaxcala",29,"Xaloztoc","039"]
[null,null,null,null,null,null,null,null,null,"Tlaxcala",29,"Xaltocan","040"]
[null,null,null,null,null,null,null,null,null,"Tlaxcala",29,"Papalotla de Xicohténcatl","041"]
[null,null,null,null,null,null,null,null,null,"Tlaxcala",29,"Xicohtzinco","042"]
[null,null,null,null,null,null,null,null,null,"Tlaxcala",29,"Yauhquemehcan","043"]
[null,null,null,null,null,null,null,null,null,"Tlaxcala",29,"Zacatelco","044"]
[null,null,null,null,null,null,null,null,null,"Tlaxcala",29,"Benito Juárez","045"]
[null,null,null,null,null,null,null,null,null,"Tlaxcala",29,"Emiliano Zapata","046"]
[null,null,null,null,null,null,null,null,null,"Tlaxcala",29,"Lázaro Cárdenas","047"]
[null,null,null,null,null,null,null,null,null,"Tlaxcala",29,"La Magdalena Tlaltelulco","048"]
[null,null,null,null,null,null,null,null,null,"Tlaxcala",29,"San Damián Texóloc","049"]
[null,null,null,null,null,null,null,null,null,"Tlaxcala",29,"San Francisco Tetlanohcan","050"]
[null,null,null,null,null,null,null,null,null,"Tlaxcala",29,"San Jerónimo Zacualpan","051"]
[null,null,null,null,null,null,null,null,null,"Tlaxcala",29,"San José Teacalco","052"]
[null,null,null,null,null,null,null,null,null,"Tlaxcala",29,"San Juan Huactzinco","053"]
[null,null,null,null,null,null,null,null,null,"Tlaxcala",29,"San Lorenzo Axocomanitla","054"]
[null,null,null,null,null,null,null,null,null,"Tlaxcala",29,"San Lucas Tecopilco","055"]
[null,null,null,null,null,null,null,null,null,"Tlaxcala",29,"Santa Ana Nopalucan","056"]
[null,null,null,null,null,null,null,null,null,"Tlaxcala",29,"Santa Apolonia Teacalco","057"]
[null,null,null,null,null,null,null,null,null,"Tlaxcala",29,"Santa Catarina Ayometla","058"]
[null,null,null,null,null,null,null,null,null,"Tlaxcala",29,"Santa Cruz Quilehtla","059"]
[null,null,null,null,null,null,null,null,null,"Tlaxcala",29,"Santa Isabel Xiloxoxtla","060"]
[null,null,null,null,null,null,null,null,null,"Tlaxcala",29,"Sin municipio identificado","999"]
[null,null,null,null,null,null,null,null,null,"Veracruz de Ignacio de la Llave",30,"Acajete","001"]
[null,null,null,null,null,null,null,null,null,"Veracruz de Ignacio de la Llave",30,"Acatlán","002"]
[null,null,null,null,null,null,null,null,null,"Veracruz de Ignacio de la Llave",30,"Acayucan","003"]
[null,null,null,null,null,null,null,null,null,"Veracruz de Ignacio de la Llave",30,"Actopan","004"]
[null,null,null,null,null,null,null,null,null,"Veracruz de Ignacio de la Llave",30,"Acula","005"]
[null,null,null,null,null,null,null,null,null,"Veracruz de Ignacio de la Llave",30,"Acultzingo","006"]
[null,null,null,null,null,null,null,null,null,"Veracruz de Ignacio de la Llave",30,"Camarón de Tejeda","007"]
[null,null,null,null,null,null,null,null,null,"Veracruz de Ignacio de la Llave",30,"Alpatláhuac","008"]
[null,null,null,null,null,null,null,null,null,"Veracruz de Ignacio de la Llave",30,"Alto Lucero de Gutiérrez Barrios","009"]
[null,null,null,null,null,null,null,null,null,"Veracruz de Ignacio de la Llave",30,"Altotonga","010"]
[null,null,null,null,null,null,null,null,null,"Veracruz de Ignacio de la Llave",30,"Alvarado","011"]
[null,null,null,null,null,null,null,null,null,"Veracruz de Ignacio de la Llave",30,"Amatitlán","012"]
[null,null,null,null,null,null,null,null,null,"Veracruz de Ignacio de la Llave",30,"Naranjos Amatlán","013"]
[null,null,null,null,null,null,null,null,null,"Veracruz de Ignacio de la Llave",30,"Amatlán de los Reyes","014"]
[null,null,null,null,null,null,null,null,null,"Veracruz de Ignacio de la Llave",30,"Angel R. Cabada","015"]
[null,null,null,null,null,null,null,null,null,"Veracruz de Ignacio de la Llave",30,"La Antigua","016"]
[null,null,null,null,null,null,null,null,null,"Veracruz de Ignacio de la Llave",30,"Apazapan","017"]
[null,null,null,null,null,null,null,null,null,"Veracruz de Ignacio de la Llave",30,"Aquila","018"]
[null,null,null,null,null,null,null,null,null,"Veracruz de Ignacio de la Llave",30,"Astacinga","019"]
[null,null,null,null,null,null,null,null,null,"Veracruz de Ignacio de la Llave",30,"Atlahuilco","020"]
[null,null,null,null,null,null,null,null,null,"Veracruz de Ignacio de la Llave",30,"Atoyac","021"]
[null,null,null,null,null,null,null,null,null,"Veracruz de Ignacio de la Llave",30,"Atzacan","022"]
[null,null,null,null,null,null,null,null,null,"Veracruz de Ignacio de la Llave",30,"Atzalan","023"]
[null,null,null,null,null,null,null,null,null,"Veracruz de Ignacio de la Llave",30,"Tlaltetela","024"]
[null,null,null,null,null,null,null,null,null,"Veracruz de Ignacio de la Llave",30,"Ayahualulco","025"]
[null,null,null,null,null,null,null,null,null,"Veracruz de Ignacio de la Llave",30,"Banderilla","026"]
[null,null,null,null,null,null,null,null,null,"Veracruz de Ignacio de la Llave",30,"Benito Juárez","027"]
[null,null,null,null,null,null,null,null,null,"Veracruz de Ignacio de la Llave",30,"Boca del Río","028"]
[null,null,null,null,null,null,null,null,null,"Veracruz de Ignacio de la Llave",30,"Calcahualco","029"]
[null,null,null,null,null,null,null,null,null,"Veracruz de Ignacio de la Llave",30,"Camerino Z. Mendoza","030"]
[null,null,null,null,null,null,null,null,null,"Veracruz de Ignacio de la Llave",30,"Carrillo Puerto","031"]
[null,null,null,null,null,null,null,null,null,"Veracruz de Ignacio de la Llave",30,"Catemaco","032"]
[null,null,null,null,null,null,null,null,null,"Veracruz de Ignacio de la Llave",30,"Cazones de Herrera","033"]
[null,null,null,null,null,null,null,null,null,"Veracruz de Ignacio de la Llave",30,"Cerro Azul","034"]
[null,null,null,null,null,null,null,null,null,"Veracruz de Ignacio de la Llave",30,"Citlaltépetl","035"]
[null,null,null,null,null,null,null,null,null,"Veracruz de Ignacio de la Llave",30,"Coacoatzintla","036"]
[null,null,null,null,null,null,null,null,null,"Veracruz de Ignacio de la Llave",30,"Coahuitlán","037"]
[null,null,null,null,null,null,null,null,null,"Veracruz de Ignacio de la Llave",30,"Coatepec","038"]
[null,null,null,null,null,null,null,null,null,"Veracruz de Ignacio de la Llave",30,"Coatzacoalcos","039"]
[null,null,null,null,null,null,null,null,null,"Veracruz de Ignacio de la Llave",30,"Coatzintla","040"]
[null,null,null,null,null,null,null,null,null,"Veracruz de Ignacio de la Llave",30,"Coetzala","041"]
[null,null,null,null,null,null,null,null,null,"Veracruz de Ignacio de la Llave",30,"Colipa","042"]
[null,null,null,null,null,null,null,null,null,"Veracruz de Ignacio de la Llave",30,"Comapa","043"]
[null,null,null,null,null,null,null,null,null,"Veracruz de Ignacio de la Llave",30,"Córdoba","044"]
[null,null,null,null,null,null,null,null,null,"Veracruz de Ignacio de la Llave",30,"Cosamaloapan de Carpio","045"]
[null,null,null,null,null,null,null,null,null,"Veracruz de Ignacio de la Llave",30,"Cosautlán de Carvajal","046"]
[null,null,null,null,null,null,null,null,null,"Veracruz de Ignacio de la Llave",30,"Coscomatepec","047"]
[null,null,null,null,null,null,null,null,null,"Veracruz de Ignacio de la Llave",30,"Cosoleacaque","048"]
[null,null,null,null,null,null,null,null,null,"Veracruz de Ignacio de la Llave",30,"Cotaxtla","049"]
[null,null,null,null,null,null,null,null,null,"Veracruz de Ignacio de la Llave",30,"Coxquihui","050"]
[null,null,null,null,null,null,null,null,null,"Veracruz de Ignacio de la Llave",30,"Coyutla","051"]
[null,null,null,null,null,null,null,null,null,"Veracruz de Ignacio de la Llave",30,"Cuichapa","052"]
[null,null,null,null,null,null,null,null,null,"Veracruz de Ignacio de la Llave",30,"Cuitláhuac","053"]
[null,null,null,null,null,null,null,null,null,"Veracruz de Ignacio de la Llave",30,"Chacaltianguis","054"]
[null,null,null,null,null,null,null,null,null,"Veracruz de Ignacio de la Llave",30,"Chalma","055"]
[null,null,null,null,null,null,null,null,null,"Veracruz de Ignacio de la Llave",30,"Chiconamel","056"]
[null,null,null,null,null,null,null,null,null,"Veracruz de Ignacio de la Llave",30,"Chiconquiaco","057"]
[null,null,null,null,null,null,null,null,null,"Veracruz de Ignacio de la Llave",30,"Chicontepec","058"]
[null,null,null,null,null,null,null,null,null,"Veracruz de Ignacio de la Llave",30,"Chinameca","059"]
[null,null,null,null,null,null,null,null,null,"Veracruz de Ignacio de la Llave",30,"Chinampa de Gorostiza","060"]
[null,null,null,null,null,null,null,null,null,"Veracruz de Ignacio de la Llave",30,"Las Choapas","061"]
[null,null,null,null,null,null,null,null,null,"Veracruz de Ignacio de la Llave",30,"Chocamán","062"]
[null,null,null,null,null,null,null,null,null,"Veracruz de Ignacio de la Llave",30,"Chontla","063"]
[null,null,null,null,null,null,null,null,null,"Veracruz de Ignacio de la Llave",30,"Chumatlán","064"]
[null,null,null,null,null,null,null,null,null,"Veracruz de Ignacio de la Llave",30,"Emiliano Zapata","065"]
[null,null,null,null,null,null,null,null,null,"Veracruz de Ignacio de la Llave",30,"Espinal","066"]
[null,null,null,null,null,null,null,null,null,"Veracruz de Ignacio de la Llave",30,"Filomeno Mata","067"]
[null,null,null,null,null,null,null,null,null,"Veracruz de Ignacio de la Llave",30,"Fortín","068"]
[null,null,null,null,null,null,null,null,null,"Veracruz de Ignacio de la Llave",30,"Gutiérrez Zamora","069"]
[null,null,null,null,null,null,null,null,null,"Veracruz de Ignacio de la Llave",30,"Hidalgotitlán","070"]
[null,null,null,null,null,null,null,null,null,"Veracruz de Ignacio de la Llave",30,"Huatusco","071"]
[null,null,null,null,null,null,null,null,null,"Veracruz de Ignacio de la Llave",30,"Huayacocotla","072"]
[null,null,null,null,null,null,null,null,null,"Veracruz de Ignacio de la Llave",30,"Hueyapan de Ocampo","073"]
[null,null,null,null,null,null,null,null,null,"Veracruz de Ignacio de la Llave",30,"Huiloapan de Cuauhtémoc","074"]
[null,null,null,null,null,null,null,null,null,"Veracruz de Ignacio de la Llave",30,"Ignacio de la Llave","075"]
[null,null,null,null,null,null,null,null,null,"Veracruz de Ignacio de la Llave",30,"Ilamatlán","076"]
[null,null,null,null,null,null,null,null,null,"Veracruz de Ignacio de la Llave",30,"Isla","077"]
[null,null,null,null,null,null,null,null,null,"Veracruz de Ignacio de la Llave",30,"Ixcatepec","078"]
[null,null,null,null,null,null,null,null,null,"Veracruz de Ignacio de la Llave",30,"Ixhuacán de los Reyes","079"]
[null,null,null,null,null,null,null,null,null,"Veracruz de Ignacio de la Llave",30,"Ixhuatlán del Café","080"]
[null,null,null,null,null,null,null,null,null,"Veracruz de Ignacio de la Llave",30,"Ixhuatlancillo","081"]
[null,null,null,null,null,null,null,null,null,"Veracruz de Ignacio de la Llave",30,"Ixhuatlán del Sureste","082"]
[null,null,null,null,null,null,null,null,null,"Veracruz de Ignacio de la Llave",30,"Ixhuatlán de Madero","083"]
[null,null,null,null,null,null,null,null,null,"Veracruz de Ignacio de la Llave",30,"Ixmatlahuacan","084"]
[null,null,null,null,null,null,null,null,null,"Veracruz de Ignacio de la Llave",30,"Ixtaczoquitlán","085"]
[null,null,null,null,null,null,null,null,null,"Veracruz de Ignacio de la Llave",30,"Jalacingo","086"]
[null,null,null,null,null,null,null,null,null,"Veracruz de Ignacio de la Llave",30,"Xalapa","087"]
[null,null,null,null,null,null,null,null,null,"Veracruz de Ignacio de la Llave",30,"Jalcomulco","088"]
[null,null,null,null,null,null,null,null,null,"Veracruz de Ignacio de la Llave",30,"Jáltipan","089"]
[null,null,null,null,null,null,null,null,null,"Veracruz de Ignacio de la Llave",30,"Jamapa","090"]
[null,null,null,null,null,null,null,null,null,"Veracruz de Ignacio de la Llave",30,"Jesús Carranza","091"]
[null,null,null,null,null,null,null,null,null,"Veracruz de Ignacio de la Llave",30,"Xico","092"]
[null,null,null,null,null,null,null,null,null,"Veracruz de Ignacio de la Llave",30,"Jilotepec","093"]
[null,null,null,null,null,null,null,null,null,"Veracruz de Ignacio de la Llave",30,"Juan Rodríguez Clara","094"]
[null,null,null,null,null,null,null,null,null,"Veracruz de Ignacio de la Llave",30,"Juchique de Ferrer","095"]
[null,null,null,null,null,null,null,null,null,"Veracruz de Ignacio de la Llave",30,"Landero y Coss","096"]
[null,null,null,null,null,null,null,null,null,"Veracruz de Ignacio de la Llave",30,"Lerdo de Tejada","097"]
[null,null,null,null,null,null,null,null,null,"Veracruz de Ignacio de la Llave",30,"Magdalena","098"]
[null,null,null,null,null,null,null,null,null,"Veracruz de Ignacio de la Llave",30,"Maltrata","099"]
[null,null,null,null,null,null,null,null,null,"Veracruz de Ignacio de la Llave",30,"Manlio Fabio Altamirano",100]
[null,null,null,null,null,null,null,null,null,"Veracruz de Ignacio de la Llave",30,"Mariano Escobedo",101]
[null,null,null,null,null,null,null,null,null,"Veracruz de Ignacio de la Llave",30,"Martínez de la Torre",102]
[null,null,null,null,null,null,null,null,null,"Veracruz de Ignacio de la Llave",30,"Mecatlán",103]
[null,null,null,null,null,null,null,null,null,"Veracruz de Ignacio de la Llave",30,"Mecayapan",104]
[null,null,null,null,null,null,null,null,null,"Veracruz de Ignacio de la Llave",30,"Medellín de Bravo",105]
[null,null,null,null,null,null,null,null,null,"Veracruz de Ignacio de la Llave",30,"Miahuatlán",106]
[null,null,null,null,null,null,null,null,null,"Veracruz de Ignacio de la Llave",30,"Las Minas",107]
[null,null,null,null,null,null,null,null,null,"Veracruz de Ignacio de la Llave",30,"Minatitlán",108]
[null,null,null,null,null,null,null,null,null,"Veracruz de Ignacio de la Llave",30,"Misantla",109]
[null,null,null,null,null,null,null,null,null,"Veracruz de Ignacio de la Llave",30,"Mixtla de Altamirano",110]
[null,null,null,null,null,null,null,null,null,"Veracruz de Ignacio de la Llave",30,"Moloacán",111]
[null,null,null,null,null,null,null,null,null,"Veracruz de Ignacio de la Llave",30,"Naolinco",112]
[null,null,null,null,null,null,null,null,null,"Veracruz de Ignacio de la Llave",30,"Naranjal",113]
[null,null,null,null,null,null,null,null,null,"Veracruz de Ignacio de la Llave",30,"Nautla",114]
[null,null,null,null,null,null,null,null,null,"Veracruz de Ignacio de la Llave",30,"Nogales",115]
[null,null,null,null,null,null,null,null,null,"Veracruz de Ignacio de la Llave",30,"Oluta",116]
[null,null,null,null,null,null,null,null,null,"Veracruz de Ignacio de la Llave",30,"Omealca",117]
[null,null,null,null,null,null,null,null,null,"Veracruz de Ignacio de la Llave",30,"Orizaba",118]
[null,null,null,null,null,null,null,null,null,"Veracruz de Ignacio de la Llave",30,"Otatitlán",119]
[null,null,null,null,null,null,null,null,null,"Veracruz de Ignacio de la Llave",30,"Oteapan",120]
[null,null,null,null,null,null,null,null,null,"Veracruz de Ignacio de la Llave",30,"Ozuluama de Mascareñas",121]
[null,null,null,null,null,null,null,null,null,"Veracruz de Ignacio de la Llave",30,"Pajapan",122]
[null,null,null,null,null,null,null,null,null,"Veracruz de Ignacio de la Llave",30,"Pánuco",123]
[null,null,null,null,null,null,null,null,null,"Veracruz de Ignacio de la Llave",30,"Papantla",124]
[null,null,null,null,null,null,null,null,null,"Veracruz de Ignacio de la Llave",30,"Paso del Macho",125]
[null,null,null,null,null,null,null,null,null,"Veracruz de Ignacio de la Llave",30,"Paso de Ovejas",126]
[null,null,null,null,null,null,null,null,null,"Veracruz de Ignacio de la Llave",30,"La Perla",127]
[null,null,null,null,null,null,null,null,null,"Veracruz de Ignacio de la Llave",30,"Perote",128]
[null,null,null,null,null,null,null,null,null,"Veracruz de Ignacio de la Llave",30,"Platón Sánchez",129]
[null,null,null,null,null,null,null,null,null,"Veracruz de Ignacio de la Llave",30,"Playa Vicente",130]
[null,null,null,null,null,null,null,null,null,"Veracruz de Ignacio de la Llave",30,"Poza Rica de Hidalgo",131]
[null,null,null,null,null,null,null,null,null,"Veracruz de Ignacio de la Llave",30,"Las Vigas de Ramírez",132]
[null,null,null,null,null,null,null,null,null,"Veracruz de Ignacio de la Llave",30,"Pueblo Viejo",133]
[null,null,null,null,null,null,null,null,null,"Veracruz de Ignacio de la Llave",30,"Puente Nacional",134]
[null,null,null,null,null,null,null,null,null,"Veracruz de Ignacio de la Llave",30,"Rafael Delgado",135]
[null,null,null,null,null,null,null,null,null,"Veracruz de Ignacio de la Llave",30,"Rafael Lucio",136]
[null,null,null,null,null,null,null,null,null,"Veracruz de Ignacio de la Llave",30,"Los Reyes",137]
[null,null,null,null,null,null,null,null,null,"Veracruz de Ignacio de la Llave",30,"Río Blanco",138]
[null,null,null,null,null,null,null,null,null,"Veracruz de Ignacio de la Llave",30,"Saltabarranca",139]
[null,null,null,null,null,null,null,null,null,"Veracruz de Ignacio de la Llave",30,"San Andrés Tenejapan",140]
[null,null,null,null,null,null,null,null,null,"Veracruz de Ignacio de la Llave",30,"San Andrés Tuxtla",141]
[null,null,null,null,null,null,null,null,null,"Veracruz de Ignacio de la Llave",30,"San Juan Evangelista",142]
[null,null,null,null,null,null,null,null,null,"Veracruz de Ignacio de la Llave",30,"Santiago Tuxtla",143]
[null,null,null,null,null,null,null,null,null,"Veracruz de Ignacio de la Llave",30,"Sayula de Alemán",144]
[null,null,null,null,null,null,null,null,null,"Veracruz de Ignacio de la Llave",30,"Soconusco",145]
[null,null,null,null,null,null,null,null,null,"Veracruz de Ignacio de la Llave",30,"Sochiapa",146]
[null,null,null,null,null,null,null,null,null,"Veracruz de Ignacio de la Llave",30,"Soledad Atzompa",147]
[null,null,null,null,null,null,null,null,null,"Veracruz de Ignacio de la Llave",30,"Soledad de Doblado",148]
[null,null,null,null,null,null,null,null,null,"Veracruz de Ignacio de la Llave",30,"Soteapan",149]
[null,null,null,null,null,null,null,null,null,"Veracruz de Ignacio de la Llave",30,"Tamalín",150]
[null,null,null,null,null,null,null,null,null,"Veracruz de Ignacio de la Llave",30,"Tamiahua",151]
[null,null,null,null,null,null,null,null,null,"Veracruz de Ignacio de la Llave",30,"Tampico Alto",152]
[null,null,null,null,null,null,null,null,null,"Veracruz de Ignacio de la Llave",30,"Tancoco",153]
[null,null,null,null,null,null,null,null,null,"Veracruz de Ignacio de la Llave",30,"Tantima",154]
[null,null,null,null,null,null,null,null,null,"Veracruz de Ignacio de la Llave",30,"Tantoyuca",155]
[null,null,null,null,null,null,null,null,null,"Veracruz de Ignacio de la Llave",30,"Tatatila",156]
[null,null,null,null,null,null,null,null,null,"Veracruz de Ignacio de la Llave",30,"Castillo de Teayo",157]
[null,null,null,null,null,null,null,null,null,"Veracruz de Ignacio de la Llave",30,"Tecolutla",158]
[null,null,null,null,null,null,null,null,null,"Veracruz de Ignacio de la Llave",30,"Tehuipango",159]
[null,null,null,null,null,null,null,null,null,"Veracruz de Ignacio de la Llave",30,"Álamo Temapache",160]
[null,null,null,null,null,null,null,null,null,"Veracruz de Ignacio de la Llave",30,"Tempoal",161]
[null,null,null,null,null,null,null,null,null,"Veracruz de Ignacio de la Llave",30,"Tenampa",162]
[null,null,null,null,null,null,null,null,null,"Veracruz de Ignacio de la Llave",30,"Tenochtitlán",163]
[null,null,null,null,null,null,null,null,null,"Veracruz de Ignacio de la Llave",30,"Teocelo",164]
[null,null,null,null,null,null,null,null,null,"Veracruz de Ignacio de la Llave",30,"Tepatlaxco",165]
[null,null,null,null,null,null,null,null,null,"Veracruz de Ignacio de la Llave",30,"Tepetlán",166]
[null,null,null,null,null,null,null,null,null,"Veracruz de Ignacio de la Llave",30,"Tepetzintla",167]
[null,null,null,null,null,null,null,null,null,"Veracruz de Ignacio de la Llave",30,"Tequila",168]
[null,null,null,null,null,null,null,null,null,"Veracruz de Ignacio de la Llave",30,"José Azueta",169]
[null,null,null,null,null,null,null,null,null,"Veracruz de Ignacio de la Llave",30,"Texcatepec",170]
[null,null,null,null,null,null,null,null,null,"Veracruz de Ignacio de la Llave",30,"Texhuacán",171]
[null,null,null,null,null,null,null,null,null,"Veracruz de Ignacio de la Llave",30,"Texistepec",172]
[null,null,null,null,null,null,null,null,null,"Veracruz de Ignacio de la Llave",30,"Tezonapa",173]
[null,null,null,null,null,null,null,null,null,"Veracruz de Ignacio de la Llave",30,"Tierra Blanca",174]
[null,null,null,null,null,null,null,null,null,"Veracruz de Ignacio de la Llave",30,"Tihuatlán",175]
[null,null,null,null,null,null,null,null,null,"Veracruz de Ignacio de la Llave",30,"Tlacojalpan",176]
[null,null,null,null,null,null,null,null,null,"Veracruz de Ignacio de la Llave",30,"Tlacolulan",177]
[null,null,null,null,null,null,null,null,null,"Veracruz de Ignacio de la Llave",30,"Tlacotalpan",178]
[null,null,null,null,null,null,null,null,null,"Veracruz de Ignacio de la Llave",30,"Tlacotepec de Mejía",179]
[null,null,null,null,null,null,null,null,null,"Veracruz de Ignacio de la Llave",30,"Tlachichilco",180]
[null,null,null,null,null,null,null,null,null,"Veracruz de Ignacio de la Llave",30,"Tlalixcoyan",181]
[null,null,null,null,null,null,null,null,null,"Veracruz de Ignacio de la Llave",30,"Tlalnelhuayocan",182]
[null,null,null,null,null,null,null,null,null,"Veracruz de Ignacio de la Llave",30,"Tlapacoyan",183]
[null,null,null,null,null,null,null,null,null,"Veracruz de Ignacio de la Llave",30,"Tlaquilpa",184]
[null,null,null,null,null,null,null,null,null,"Veracruz de Ignacio de la Llave",30,"Tlilapan",185]
[null,null,null,null,null,null,null,null,null,"Veracruz de Ignacio de la Llave",30,"Tomatlán",186]
[null,null,null,null,null,null,null,null,null,"Veracruz de Ignacio de la Llave",30,"Tonayán",187]
[null,null,null,null,null,null,null,null,null,"Veracruz de Ignacio de la Llave",30,"Totutla",188]
[null,null,null,null,null,null,null,null,null,"Veracruz de Ignacio de la Llave",30,"Tuxpan",189]
[null,null,null,null,null,null,null,null,null,"Veracruz de Ignacio de la Llave",30,"Tuxtilla",190]
[null,null,null,null,null,null,null,null,null,"Veracruz de Ignacio de la Llave",30,"Ursulo Galván",191]
[null,null,null,null,null,null,null,null,null,"Veracruz de Ignacio de la Llave",30,"Vega de Alatorre",192]
[null,null,null,null,null,null,null,null,null,"Veracruz de Ignacio de la Llave",30,"Veracruz",193]
[null,null,null,null,null,null,null,null,null,"Veracruz de Ignacio de la Llave",30,"Villa Aldama",194]
[null,null,null,null,null,null,null,null,null,"Veracruz de Ignacio de la Llave",30,"Xoxocotla",195]
[null,null,null,null,null,null,null,null,null,"Veracruz de Ignacio de la Llave",30,"Yanga",196]
[null,null,null,null,null,null,null,null,null,"Veracruz de Ignacio de la Llave",30,"Yecuatla",197]
[null,null,null,null,null,null,null,null,null,"Veracruz de Ignacio de la Llave",30,"Zacualpan",198]
[null,null,null,null,null,null,null,null,null,"Veracruz de Ignacio de la Llave",30,"Zaragoza",199]
[null,null,null,null,null,null,null,null,null,"Veracruz de Ignacio de la Llave",30,"Zentla",200]
[null,null,null,null,null,null,null,null,null,"Veracruz de Ignacio de la Llave",30,"Zongolica",201]
[null,null,null,null,null,null,null,null,null,"Veracruz de Ignacio de la Llave",30,"Zontecomatlán de López y Fuentes",202]
[null,null,null,null,null,null,null,null,null,"Veracruz de Ignacio de la Llave",30,"Zozocolco de Hidalgo",203]
[null,null,null,null,null,null,null,null,null,"Veracruz de Ignacio de la Llave",30,"Agua Dulce",204]
[null,null,null,null,null,null,null,null,null,"Veracruz de Ignacio de la Llave",30,"El Higo",205]
[null,null,null,null,null,null,null,null,null,"Veracruz de Ignacio de la Llave",30,"Nanchital de Lázaro Cárdenas del Río",206]
[null,null,null,null,null,null,null,null,null,"Veracruz de Ignacio de la Llave",30,"Tres Valles",207]
[null,null,null,null,null,null,null,null,null,"Veracruz de Ignacio de la Llave",30,"Carlos A. Carrillo",208]
[null,null,null,null,null,null,null,null,null,"Veracruz de Ignacio de la Llave",30,"Tatahuicapan de Juárez",209]
[null,null,null,null,null,null,null,null,null,"Veracruz de Ignacio de la Llave",30,"Uxpanapa",210]
[null,null,null,null,null,null,null,null,null,"Veracruz de Ignacio de la Llave",30,"San Rafael",211]
[null,null,null,null,null,null,null,null,null,"Veracruz de Ignacio de la Llave",30,"Santiago Sochiapan",212]
[null,null,null,null,null,null,null,null,null,"Veracruz de Ignacio de la Llave",30,"Sin municipio identificado","999"]
[null,null,null,null,null,null,null,null,null,"Yucatán",31,"Abalá","001"]
[null,null,null,null,null,null,null,null,null,"Yucatán",31,"Acanceh","002"]
[null,null,null,null,null,null,null,null,null,"Yucatán",31,"Akil","003"]
[null,null,null,null,null,null,null,null,null,"Yucatán",31,"Baca","004"]
[null,null,null,null,null,null,null,null,null,"Yucatán",31,"Bokobá","005"]
[null,null,null,null,null,null,null,null,null,"Yucatán",31,"Buctzotz","006"]
[null,null,null,null,null,null,null,null,null,"Yucatán",31,"Cacalchén","007"]
[null,null,null,null,null,null,null,null,null,"Yucatán",31,"Calotmul","008"]
[null,null,null,null,null,null,null,null,null,"Yucatán",31,"Cansahcab","009"]
[null,null,null,null,null,null,null,null,null,"Yucatán",31,"Cantamayec","010"]
[null,null,null,null,null,null,null,null,null,"Yucatán",31,"Celestún","011"]
[null,null,null,null,null,null,null,null,null,"Yucatán",31,"Cenotillo","012"]
[null,null,null,null,null,null,null,null,null,"Yucatán",31,"Conkal","013"]
[null,null,null,null,null,null,null,null,null,"Yucatán",31,"Cuncunul","014"]
[null,null,null,null,null,null,null,null,null,"Yucatán",31,"Cuzamá","015"]
[null,null,null,null,null,null,null,null,null,"Yucatán",31,"Chacsinkín","016"]
[null,null,null,null,null,null,null,null,null,"Yucatán",31,"Chankom","017"]
[null,null,null,null,null,null,null,null,null,"Yucatán",31,"Chapab","018"]
[null,null,null,null,null,null,null,null,null,"Yucatán",31,"Chemax","019"]
[null,null,null,null,null,null,null,null,null,"Yucatán",31,"Chicxulub Pueblo","020"]
[null,null,null,null,null,null,null,null,null,"Yucatán",31,"Chichimilá","021"]
[null,null,null,null,null,null,null,null,null,"Yucatán",31,"Chikindzonot","022"]
[null,null,null,null,null,null,null,null,null,"Yucatán",31,"Chocholá","023"]
[null,null,null,null,null,null,null,null,null,"Yucatán",31,"Chumayel","024"]
[null,null,null,null,null,null,null,null,null,"Yucatán",31,"Dzan","025"]
[null,null,null,null,null,null,null,null,null,"Yucatán",31,"Dzemul","026"]
[null,null,null,null,null,null,null,null,null,"Yucatán",31,"Dzidzantún","027"]
[null,null,null,null,null,null,null,null,null,"Yucatán",31,"Dzilam de Bravo","028"]
[null,null,null,null,null,null,null,null,null,"Yucatán",31,"Dzilam González","029"]
[null,null,null,null,null,null,null,null,null,"Yucatán",31,"Dzitás","030"]
[null,null,null,null,null,null,null,null,null,"Yucatán",31,"Dzoncauich","031"]
[null,null,null,null,null,null,null,null,null,"Yucatán",31,"Espita","032"]
[null,null,null,null,null,null,null,null,null,"Yucatán",31,"Halachó","033"]
[null,null,null,null,null,null,null,null,null,"Yucatán",31,"Hocabá","034"]
[null,null,null,null,null,null,null,null,null,"Yucatán",31,"Hoctún","035"]
[null,null,null,null,null,null,null,null,null,"Yucatán",31,"Homún","036"]
[null,null,null,null,null,null,null,null,null,"Yucatán",31,"Huhí","037"]
[null,null,null,null,null,null,null,null,null,"Yucatán",31,"Hunucmá","038"]
[null,null,null,null,null,null,null,null,null,"Yucatán",31,"Ixil","039"]
[null,null,null,null,null,null,null,null,null,"Yucatán",31,"Izamal","040"]
[null,null,null,null,null,null,null,null,null,"Yucatán",31,"Kanasín","041"]
[null,null,null,null,null,null,null,null,null,"Yucatán",31,"Kantunil","042"]
[null,null,null,null,null,null,null,null,null,"Yucatán",31,"Kaua","043"]
[null,null,null,null,null,null,null,null,null,"Yucatán",31,"Kinchil","044"]
[null,null,null,null,null,null,null,null,null,"Yucatán",31,"Kopomá","045"]
[null,null,null,null,null,null,null,null,null,"Yucatán",31,"Mama","046"]
[null,null,null,null,null,null,null,null,null,"Yucatán",31,"Maní","047"]
[null,null,null,null,null,null,null,null,null,"Yucatán",31,"Maxcanú","048"]
[null,null,null,null,null,null,null,null,null,"Yucatán",31,"Mayapán","049"]
[null,null,null,null,null,null,null,null,null,"Yucatán",31,"Mérida","050"]
[null,null,null,null,null,null,null,null,null,"Yucatán",31,"Mocochá","051"]
[null,null,null,null,null,null,null,null,null,"Yucatán",31,"Motul","052"]
[null,null,null,null,null,null,null,null,null,"Yucatán",31,"Muna","053"]
[null,null,null,null,null,null,null,null,null,"Yucatán",31,"Muxupip","054"]
[null,null,null,null,null,null,null,null,null,"Yucatán",31,"Opichén","055"]
[null,null,null,null,null,null,null,null,null,"Yucatán",31,"Oxkutzcab","056"]
[null,null,null,null,null,null,null,null,null,"Yucatán",31,"Panabá","057"]
[null,null,null,null,null,null,null,null,null,"Yucatán",31,"Peto","058"]
[null,null,null,null,null,null,null,null,null,"Yucatán",31,"Progreso","059"]
[null,null,null,null,null,null,null,null,null,"Yucatán",31,"Quintana Roo","060"]
[null,null,null,null,null,null,null,null,null,"Yucatán",31,"Río Lagartos","061"]
[null,null,null,null,null,null,null,null,null,"Yucatán",31,"Sacalum","062"]
[null,null,null,null,null,null,null,null,null,"Yucatán",31,"Samahil","063"]
[null,null,null,null,null,null,null,null,null,"Yucatán",31,"Sanahcat","064"]
[null,null,null,null,null,null,null,null,null,"Yucatán",31,"San Felipe","065"]
[null,null,null,null,null,null,null,null,null,"Yucatán",31,"Santa Elena","066"]
[null,null,null,null,null,null,null,null,null,"Yucatán",31,"Seyé","067"]
[null,null,null,null,null,null,null,null,null,"Yucatán",31,"Sinanché","068"]
[null,null,null,null,null,null,null,null,null,"Yucatán",31,"Sotuta","069"]
[null,null,null,null,null,null,null,null,null,"Yucatán",31,"Sucilá","070"]
[null,null,null,null,null,null,null,null,null,"Yucatán",31,"Sudzal","071"]
[null,null,null,null,null,null,null,null,null,"Yucatán",31,"Suma","072"]
[null,null,null,null,null,null,null,null,null,"Yucatán",31,"Tahdziú","073"]
[null,null,null,null,null,null,null,null,null,"Yucatán",31,"Tahmek","074"]
[null,null,null,null,null,null,null,null,null,"Yucatán",31,"Teabo","075"]
[null,null,null,null,null,null,null,null,null,"Yucatán",31,"Tecoh","076"]
[null,null,null,null,null,null,null,null,null,"Yucatán",31,"Tekal de Venegas","077"]
[null,null,null,null,null,null,null,null,null,"Yucatán",31,"Tekantó","078"]
[null,null,null,null,null,null,null,null,null,"Yucatán",31,"Tekax","079"]
[null,null,null,null,null,null,null,null,null,"Yucatán",31,"Tekit","080"]
[null,null,null,null,null,null,null,null,null,"Yucatán",31,"Tekom","081"]
[null,null,null,null,null,null,null,null,null,"Yucatán",31,"Telchac Pueblo","082"]
[null,null,null,null,null,null,null,null,null,"Yucatán",31,"Telchac Puerto","083"]
[null,null,null,null,null,null,null,null,null,"Yucatán",31,"Temax","084"]
[null,null,null,null,null,null,null,null,null,"Yucatán",31,"Temozón","085"]
[null,null,null,null,null,null,null,null,null,"Yucatán",31,"Tepakán","086"]
[null,null,null,null,null,null,null,null,null,"Yucatán",31,"Tetiz","087"]
[null,null,null,null,null,null,null,null,null,"Yucatán",31,"Teya","088"]
[null,null,null,null,null,null,null,null,null,"Yucatán",31,"Ticul","089"]
[null,null,null,null,null,null,null,null,null,"Yucatán",31,"Timucuy","090"]
[null,null,null,null,null,null,null,null,null,"Yucatán",31,"Tinum","091"]
[null,null,null,null,null,null,null,null,null,"Yucatán",31,"Tixcacalcupul","092"]
[null,null,null,null,null,null,null,null,null,"Yucatán",31,"Tixkokob","093"]
[null,null,null,null,null,null,null,null,null,"Yucatán",31,"Tixméhuac","094"]
[null,null,null,null,null,null,null,null,null,"Yucatán",31,"Tixpéhual","095"]
[null,null,null,null,null,null,null,null,null,"Yucatán",31,"Tizimín","096"]
[null,null,null,null,null,null,null,null,null,"Yucatán",31,"Tunkás","097"]
[null,null,null,null,null,null,null,null,null,"Yucatán",31,"Tzucacab","098"]
[null,null,null,null,null,null,null,null,null,"Yucatán",31,"Uayma","099"]
[null,null,null,null,null,null,null,null,null,"Yucatán",31,"Ucú",100]
[null,null,null,null,null,null,null,null,null,"Yucatán",31,"Umán",101]
[null,null,null,null,null,null,null,null,null,"Yucatán",31,"Valladolid",102]
[null,null,null,null,null,null,null,null,null,"Yucatán",31,"Xocchel",103]
[null,null,null,null,null,null,null,null,null,"Yucatán",31,"Yaxcabá",104]
[null,null,null,null,null,null,null,null,null,"Yucatán",31,"Yaxkukul",105]
[null,null,null,null,null,null,null,null,null,"Yucatán",31,"Yobaín",106]
[null,null,null,null,null,null,null,null,null,"Yucatán",31,"Sin municipio identificado","999"]
[null,null,null,null,null,null,null,null,null,"Zacatecas",32,"Apozol","001"]
[null,null,null,null,null,null,null,null,null,"Zacatecas",32,"Apulco","002"]
[null,null,null,null,null,null,null,null,null,"Zacatecas",32,"Atolinga","003"]
[null,null,null,null,null,null,null,null,null,"Zacatecas",32,"Benito Juárez","004"]
[null,null,null,null,null,null,null,null,null,"Zacatecas",32,"Calera","005"]
[null,null,null,null,null,null,null,null,null,"Zacatecas",32,"Cañitas de Felipe Pescador","006"]
[null,null,null,null,null,null,null,null,null,"Zacatecas",32,"Concepción del Oro","007"]
[null,null,null,null,null,null,null,null,null,"Zacatecas",32,"Cuauhtémoc","008"]
[null,null,null,null,null,null,null,null,null,"Zacatecas",32,"Chalchihuites","009"]
[null,null,null,null,null,null,null,null,null,"Zacatecas",32,"Fresnillo","010"]
[null,null,null,null,null,null,null,null,null,"Zacatecas",32,"Trinidad García de la Cadena","011"]
[null,null,null,null,null,null,null,null,null,"Zacatecas",32,"Genaro Codina","012"]
[null,null,null,null,null,null,null,null,null,"Zacatecas",32,"General Enrique Estrada","013"]
[null,null,null,null,null,null,null,null,null,"Zacatecas",32,"General Francisco R. Murguía","014"]
[null,null,null,null,null,null,null,null,null,"Zacatecas",32,"El Plateado de Joaquín Amaro","015"]
[null,null,null,null,null,null,null,null,null,"Zacatecas",32,"General Pánfilo Natera","016"]
[null,null,null,null,null,null,null,null,null,"Zacatecas",32,"Guadalupe","017"]
[null,null,null,null,null,null,null,null,null,"Zacatecas",32,"Huanusco","018"]
[null,null,null,null,null,null,null,null,null,"Zacatecas",32,"Jalpa","019"]
[null,null,null,null,null,null,null,null,null,"Zacatecas",32,"Jerez","020"]
[null,null,null,null,null,null,null,null,null,"Zacatecas",32,"Jiménez del Teul","021"]
[null,null,null,null,null,null,null,null,null,"Zacatecas",32,"Juan Aldama","022"]
[null,null,null,null,null,null,null,null,null,"Zacatecas",32,"Juchipila","023"]
[null,null,null,null,null,null,null,null,null,"Zacatecas",32,"Loreto","024"]
[null,null,null,null,null,null,null,null,null,"Zacatecas",32,"Luis Moya","025"]
[null,null,null,null,null,null,null,null,null,"Zacatecas",32,"Mazapil","026"]
[null,null,null,null,null,null,null,null,null,"Zacatecas",32,"Melchor Ocampo","027"]
[null,null,null,null,null,null,null,null,null,"Zacatecas",32,"Mezquital del Oro","028"]
[null,null,null,null,null,null,null,null,null,"Zacatecas",32,"Miguel Auza","029"]
[null,null,null,null,null,null,null,null,null,"Zacatecas",32,"Momax","030"]
[null,null,null,null,null,null,null,null,null,"Zacatecas",32,"Monte Escobedo","031"]
[null,null,null,null,null,null,null,null,null,"Zacatecas",32,"Morelos","032"]
[null,null,null,null,null,null,null,null,null,"Zacatecas",32,"Moyahua de Estrada","033"]
[null,null,null,null,null,null,null,null,null,"Zacatecas",32,"Nochistlán de Mejía","034"]
[null,null,null,null,null,null,null,null,null,"Zacatecas",32,"Noria de Ángeles","035"]
[null,null,null,null,null,null,null,null,null,"Zacatecas",32,"Ojocaliente","036"]
[null,null,null,null,null,null,null,null,null,"Zacatecas",32,"Pánuco","037"]
[null,null,null,null,null,null,null,null,null,"Zacatecas",32,"Pinos","038"]
[null,null,null,null,null,null,null,null,null,"Zacatecas",32,"Río Grande","039"]
[null,null,null,null,null,null,null,null,null,"Zacatecas",32,"Sain Alto","040"]
[null,null,null,null,null,null,null,null,null,"Zacatecas",32,"El Salvador","041"]
[null,null,null,null,null,null,null,null,null,"Zacatecas",32,"Sombrerete","042"]
[null,null,null,null,null,null,null,null,null,"Zacatecas",32,"Susticacán","043"]
[null,null,null,null,null,null,null,null,null,"Zacatecas",32,"Tabasco","044"]
[null,null,null,null,null,null,null,null,null,"Zacatecas",32,"Tepechitlán","045"]
[null,null,null,null,null,null,null,null,null,"Zacatecas",32,"Tepetongo","046"]
[null,null,null,null,null,null,null,null,null,"Zacatecas",32,"Teúl de González Ortega","047"]
[null,null,null,null,null,null,null,null,null,"Zacatecas",32,"Tlaltenango de Sánchez Román","048"]
[null,null,null,null,null,null,null,null,null,"Zacatecas",32,"Valparaíso","049"]
[null,null,null,null,null,null,null,null,null,"Zacatecas",32,"Vetagrande","050"]
[null,null,null,null,null,null,null,null,null,"Zacatecas",32,"Villa de Cos","051"]
[null,null,null,null,null,null,null,null,null,"Zacatecas",32,"Villa García","052"]
[null,null,null,null,null,null,null,null,null,"Zacatecas",32,"Villa González Ortega","053"]
[null,null,null,null,null,null,null,null,null,"Zacatecas",32,"Villa Hidalgo","054"]
[null,null,null,null,null,null,null,null,null,"Zacatecas",32,"Villanueva","055"]
[null,null,null,null,null,null,null,null,null,"Zacatecas",32,"Zacatecas","056"]
[null,null,null,null,null,null,null,null,null,"Zacatecas",32,"Trancoso","057"]
[null,null,null,null,null,null,null,null,null,"Zacatecas",32,"Santa María de la Paz","058"]
[null,null,null,null,null,null,null,null,null,"Zacatecas",32,"Sin municipio identificado","999"]

{"sheet":"comparativo","index":15,"n_rows":33,"n_cols":24,"rows_kept":33,"cut":false,"hidden":true,"merged":[]}
["CVE_ENTIDAD","P2_28","P2_31_1_C1","P2_31_2_C1","P2_31_3_C1","P2_31_1_C2","P2_31_2_C2","P2_31_3_C2","P2_31_1_C3","P2_31_2_C3","P2_31_3_C3","P2_32_1","P2_32_2","P2_33","P2_34_1","P2_34_2","P2_36","P2_37_1","P2_37_2","P2_53_A_ESP","P2_59","P2_71_1","P2_71_2","P2_71_3"]
["01",1,715992,100,100,0,-2,-2,31992,99,100,674410,-2,2,-2,-2,1,675501,-2,99,1,1,297021,43]
["02",1,3812084,100,0,0,-2,-2,0,-2,-2,1724213,-2,2,-2,-2,1,1724213,-2,100,1,1,551815,32]
["03",2,564745,70,41,98500,70,41,1872,60,46,677796,-2,2,-2,-2,1,153201,-2,80,1,2,-2,-2]
["04",1,1598745,99,100,0,-2,-2,9921,99,100,364576,-2,2,-2,-2,1,368298,-2,99,1,1,153028,42]
["05",1,89975733,74,26,67254847,78,22,18852356,56,44,895325,-2,2,-2,-2,1,928268,-2,-2,1,1,135577,17]
["06",1,1103400,92,8,9384,60,66,11034,100,0,394225,-2,2,-2,-2,1,407255,-2,79,1,1,249314,62]
["07",2,2473768,100,100,2413109,100,100,44403,100,100,1077548,-2,1,1077548,-2,1,1077548,-2,-2,1,2,-2,-2]
["08",2,7972889,80,20,3801716,76,94,51377,100,80,1501767,-2,2,-2,-2,1,1501767,-2,76,1,2,-2,-2]
["09",1,2907287,100,0,0,-2,-2,0,-2,-2,2503088,-2,2,-2,-2,1,2506307,-2,100,1,2,-2,-2]
["10",2,485741,70,100,1217,60,100,710,100,100,-1,9,2,-2,-2,1,485741,-2,65,1,1,"NS",22]
["11",1,6982864,59,41,0,-2,-2,133165,15,85,2218694,-2,2,-2,-2,1,2667298,-2,59,1,2,-2,-2]
["12",2,898316,100,100,"NS",-1,-1,864,100,100,719252,-2,1,727138,-2,1,727138,-2,-2,1,2,-2,-2]
["13",2,47334,100,0,5242,0,100,47916,53,47,447779,-2,2,-2,-2,1,220556,-2,64,1,1,9454,4]
["14",1,4009658,100,100,0,-2,-2,129706,100,100,3959223,-2,2,-2,-2,1,4009658,-2,57,1,1,69237,2]
["15",1,3581300,100,0,567768,1,100,9516,100,0,3021643,-2,2,-2,-2,1,3037835,-2,100,1,1,794729,28]
["16",2,3770000,0,100,200070,0,100,75542,0,100,2076519,-2,2,-2,-2,1,1037,-2,-2,1,2,-2,-2]
["17",2,118881,70,100,196728,80,100,4535,90,100,563303,-2,2,-2,-2,1,570441,-2,85,1,1,235353,42]
["18",1,"NS",-1,-1,1746,98,100,22191,95,100,376439,-2,2,-2,-2,1,377062,-2,95,1,1,1332,1]
["19",1,9315794,95,100,2915,95,100,290251,100,100,2651726,-2,2,-2,-2,1,358823,-2,95,1,1,358823,"NS"]
["20",2,27645,100,0,39545,60,78,19500,60,79,20487,-2,2,-2,-2,1,20487,-2,80,1,2,-2,-2]
["21",2,3484663,67,33,156946,57,43,111123,48,52,3139429,-2,1,1870475,-2,1,1268954,-2,61,1,1,88524,6]
["22",1,191164,100,100,3248,100,0,2311,0,100,1032088,-2,2,-2,-2,1,1032088,-2,92,1,1,823692,80]
["23",1,93739512,100,0,1807,100,100,3153,100,100,1507507,-2,2,-2,-2,1,943580,-2,100,1,2,-2,-2]
["24",1,2856984,100,100,0,-2,-2,32000,100,100,1422892,-2,2,-2,-2,1,1121498,-2,100,1,1,30891,8]
["25",2,4870481,70,100,89710,70,100,22637,70,100,1228146,-2,1,866703,-2,1,173098,-2,90,1,1,730000,50]
["26",2,2318795,60,100,117380,38,100,10216,24,100,1588806,-2,2,-2,-2,1,363402,-2,60,1,2,-2,-2]
["27",1,2858425,97,89,565304,89,82,24910,96,100,863603,-2,2,-2,-2,1,896737,-2,90,1,2,-2,-2]
["28",1,3620366,100,100,60000,32,100,41000,35,100,1058079,-2,2,-2,-2,1,1065441,-2,35,1,1,298629,24]
["29",2,223080,100,100,36866,100,100,36866,100,100,352072,-2,2,-2,-2,1,107445,-2,-2,1,2,-2,-2]
["30",2,977228,100,0,0,-2,-2,18432,0,100,-1,9,2,-2,-2,2,-2,-2,100,1,2,-2,-2]
["31",1,4871893,100,0,778146,100,0,11917,100,100,1430474,-2,2,-2,-2,1,1446470,-2,100,1,1,1430474,100]
["32",2,"NS",-1,-1,35856,20,80,20762,20,80,20625,-2,2,-2,-2,1,20855,-2,-2,1,2,-2,-2]